﻿2026-08-18T01:34:02.3459261Z Current runner version: '2.336.0'
2026-08-18T01:34:02.3464268Z Runner name: 'hfenduleam'
2026-08-18T01:34:02.3464714Z Runner group name: 'Default'
2026-08-18T01:34:02.3465234Z Machine name: 'HFENDULEAM'
2026-08-18T01:34:02.3468543Z ##[group]GITHUB_TOKEN Permissions
2026-08-18T01:34:02.3470006Z Actions: write
2026-08-18T01:34:02.3470388Z ArtifactMetadata: write
2026-08-18T01:34:02.3471064Z Attestations: write
2026-08-18T01:34:02.3471411Z Checks: write
2026-08-18T01:34:02.3471839Z CodeQuality: write
2026-08-18T01:34:02.3472168Z Contents: write
2026-08-18T01:34:02.3472508Z CopilotRequests: write
2026-08-18T01:34:02.3472876Z Deployments: write
2026-08-18T01:34:02.3473234Z Discussions: write
2026-08-18T01:34:02.3473579Z Drives: write
2026-08-18T01:34:02.3473889Z Issues: write
2026-08-18T01:34:02.3474255Z Metadata: read
2026-08-18T01:34:02.3474598Z Models: read
2026-08-18T01:34:02.3474914Z Packages: write
2026-08-18T01:34:02.3475256Z Pages: write
2026-08-18T01:34:02.3475948Z PullRequests: write
2026-08-18T01:34:02.3476363Z RepositoryProjects: write
2026-08-18T01:34:02.3476784Z SecurityEvents: write
2026-08-18T01:34:02.3477127Z Statuses: write
2026-08-18T01:34:02.3477454Z VulnerabilityAlerts: read
2026-08-18T01:34:02.3477827Z ##[endgroup]
2026-08-18T01:34:02.3479197Z Secret source: Actions
2026-08-18T01:34:02.3479824Z Prepare workflow directory
2026-08-18T01:34:02.3891317Z Prepare all required actions
2026-08-18T01:34:02.3931432Z Getting action download info
2026-08-18T01:34:02.6787652Z Download action repository 'actions/checkout@v5' (SHA:fbc6f3992d24b796d5a048ff273f7fcc4a7b6c09)
2026-08-18T01:34:03.5980797Z Complete job name: unit (self-hosted, Windows, hfenduleam)
2026-08-18T01:34:03.7464059Z ##[group]Run $floorBytes = 32GB
2026-08-18T01:34:03.7465023Z [36;1m$floorBytes = 32GB[0m
2026-08-18T01:34:03.7465751Z [36;1m$drive = (Get-Item $env:GITHUB_WORKSPACE).PSDrive[0m
2026-08-18T01:34:03.7466943Z [36;1m$freeBytes = [int64]$drive.Free[0m
2026-08-18T01:34:03.7468067Z [36;1mWrite-Host "disk preflight: drive=$($drive.Root) free_bytes=$freeBytes floor_bytes=$floorBytes"[0m
2026-08-18T01:34:03.7469301Z [36;1mif ($freeBytes -lt $floorBytes) {[0m
2026-08-18T01:34:03.7470475Z [36;1m  Write-Error "RESOURCE=disk drive=$($drive.Root) free_bytes=$freeBytes floor_bytes=$floorBytes"[0m
2026-08-18T01:34:03.7471463Z [36;1m  exit 1[0m
2026-08-18T01:34:03.7472067Z [36;1m}[0m
2026-08-18T01:34:03.7485410Z shell: C:\Program Files\PowerShell\7\pwsh.EXE -command ". '{0}'"
2026-08-18T01:34:03.7486832Z ##[endgroup]
2026-08-18T01:34:04.1334191Z disk preflight: drive=C:\ free_bytes=73424945152 floor_bytes=34359738368
2026-08-18T01:34:04.2191696Z ##[group]Run actions/checkout@v5
2026-08-18T01:34:04.2192570Z with:
2026-08-18T01:34:04.2193176Z   repository: BigscreenVR/spt-bs-core
2026-08-18T01:34:04.2198843Z   token: ***
2026-08-18T01:34:04.2199403Z   ssh-strict: true
2026-08-18T01:34:04.2199985Z   ssh-user: git
2026-08-18T01:34:04.2200685Z   persist-credentials: true
2026-08-18T01:34:04.2201494Z   clean: true
2026-08-18T01:34:04.2202138Z   sparse-checkout-cone-mode: true
2026-08-18T01:34:04.2202809Z   fetch-depth: 1
2026-08-18T01:34:04.2203402Z   fetch-tags: false
2026-08-18T01:34:04.2204050Z   show-progress: true
2026-08-18T01:34:04.2204629Z   lfs: false
2026-08-18T01:34:04.2205322Z   submodules: false
2026-08-18T01:34:04.2206089Z   set-safe-directory: true
2026-08-18T01:34:04.2206980Z   allow-unsafe-pr-checkout: false
2026-08-18T01:34:04.2207922Z ##[endgroup]
2026-08-18T01:34:04.4649677Z Syncing repository: BigscreenVR/spt-bs-core
2026-08-18T01:34:04.4652145Z ##[group]Getting Git version info
2026-08-18T01:34:04.4653411Z Working directory is 'C:\actions-runner\_work\spt-bs-core\spt-bs-core'
2026-08-18T01:34:04.4933802Z [command]"C:\Program Files\Git\cmd\git.exe" version
2026-08-18T01:34:04.5166025Z git version 2.43.0.windows.1
2026-08-18T01:34:04.5194605Z ##[endgroup]
2026-08-18T01:34:04.5204558Z Copying 'C:\Users\decid\.gitconfig' to 'C:\actions-runner\_work\_temp\6a08b28f-0375-4690-a7c6-d6e59b6489d8\.gitconfig'
2026-08-18T01:34:04.5219326Z Temporarily overriding HOME='C:\actions-runner\_work\_temp\6a08b28f-0375-4690-a7c6-d6e59b6489d8' before making global git config changes
2026-08-18T01:34:04.5221869Z Adding repository directory to the temporary git global config as a safe directory
2026-08-18T01:34:04.5225168Z [command]"C:\Program Files\Git\cmd\git.exe" config --global --add safe.directory C:\actions-runner\_work\spt-bs-core\spt-bs-core
2026-08-18T01:34:04.5522489Z [command]"C:\Program Files\Git\cmd\git.exe" config --local --get remote.origin.url
2026-08-18T01:34:04.5842858Z https://github.com/BigscreenVR/spt-bs-core
2026-08-18T01:34:04.5869229Z ##[group]Removing previously created refs, to avoid conflicts
2026-08-18T01:34:04.5874099Z [command]"C:\Program Files\Git\cmd\git.exe" rev-parse --symbolic-full-name --verify --quiet HEAD
2026-08-18T01:34:04.6096538Z HEAD
2026-08-18T01:34:04.6474262Z ##[endgroup]
2026-08-18T01:34:04.6475482Z [command]"C:\Program Files\Git\cmd\git.exe" submodule status
2026-08-18T01:34:05.1258186Z ##[group]Cleaning the repository
2026-08-18T01:34:05.1262143Z [command]"C:\Program Files\Git\cmd\git.exe" clean -ffdx
2026-08-18T01:34:15.2145020Z Removing target/
2026-08-18T01:34:15.2176239Z [command]"C:\Program Files\Git\cmd\git.exe" reset --hard HEAD
2026-08-18T01:34:15.4186071Z HEAD is now at ce115d994 Merge d9eb7d43e29c50b20d4ae32dcadce19c40598df7 into f1a560fcf0546e5cb9c0120efd3c0e173fa8f8dc
2026-08-18T01:34:15.4213977Z ##[endgroup]
2026-08-18T01:34:15.4218107Z ##[group]Disabling automatic garbage collection
2026-08-18T01:34:15.4223373Z [command]"C:\Program Files\Git\cmd\git.exe" config --local gc.auto 0
2026-08-18T01:34:15.4521601Z ##[endgroup]
2026-08-18T01:34:15.4522014Z ##[group]Setting up auth
2026-08-18T01:34:15.4528214Z [command]"C:\Program Files\Git\cmd\git.exe" config --local --name-only --get-regexp core\.sshCommand
2026-08-18T01:34:15.4772238Z [command]"C:\Program Files\Git\cmd\git.exe" submodule foreach --recursive "sh -c \"git config --local --name-only --get-regexp 'core\.sshCommand' && git config --local --unset-all 'core.sshCommand' || :\""
2026-08-18T01:34:16.1965685Z [command]"C:\Program Files\Git\cmd\git.exe" config --local --name-only --get-regexp http\.https\:\/\/github\.com\/\.extraheader
2026-08-18T01:34:16.2710738Z [command]"C:\Program Files\Git\cmd\git.exe" submodule foreach --recursive "sh -c \"git config --local --name-only --get-regexp 'http\.https\:\/\/github\.com\/\.extraheader' && git config --local --unset-all 'http.https://github.com/.extraheader' || :\""
2026-08-18T01:34:17.2502387Z [command]"C:\Program Files\Git\cmd\git.exe" config --local --name-only --get-regexp ^includeIf\.gitdir:
2026-08-18T01:34:17.2745691Z [command]"C:\Program Files\Git\cmd\git.exe" submodule foreach --recursive "git config --local --show-origin --name-only --get-regexp remote.origin.url"
2026-08-18T01:34:17.7938008Z [command]"C:\Program Files\Git\cmd\git.exe" config --local http.https://github.com/.extraheader "AUTHORIZATION: basic ***"
2026-08-18T01:34:17.8302092Z ##[endgroup]
2026-08-18T01:34:17.8302649Z ##[group]Fetching the repository
2026-08-18T01:34:17.8311101Z [command]"C:\Program Files\Git\cmd\git.exe" -c protocol.version=2 fetch --no-tags --prune --no-recurse-submodules --depth=1 origin +6a13e365ef15247ffa437c1b204b7af4c1547fb9:refs/remotes/pull/149/merge
2026-08-18T01:34:19.3075617Z From https://github.com/BigscreenVR/spt-bs-core
2026-08-18T01:34:19.3076231Z  * [new ref]             6a13e365ef15247ffa437c1b204b7af4c1547fb9 -> pull/149/merge
2026-08-18T01:34:19.3215630Z ##[endgroup]
2026-08-18T01:34:19.3216186Z ##[group]Determining the checkout info
2026-08-18T01:34:19.3216733Z ##[endgroup]
2026-08-18T01:34:19.3221768Z [command]"C:\Program Files\Git\cmd\git.exe" sparse-checkout disable
2026-08-18T01:34:19.3512289Z [command]"C:\Program Files\Git\cmd\git.exe" config --local --unset-all extensions.worktreeConfig
2026-08-18T01:34:19.3749682Z ##[group]Checking out the ref
2026-08-18T01:34:19.3754080Z [command]"C:\Program Files\Git\cmd\git.exe" checkout --progress --force refs/remotes/pull/149/merge
2026-08-18T01:34:19.5286764Z Previous HEAD position was ce115d994 Merge d9eb7d43e29c50b20d4ae32dcadce19c40598df7 into f1a560fcf0546e5cb9c0120efd3c0e173fa8f8dc
2026-08-18T01:34:19.5288440Z HEAD is now at 6a13e365e Merge 2bd36f1d557228c134ba1791c84f584cb8c8c8d1 into d9eb7d43e29c50b20d4ae32dcadce19c40598df7
2026-08-18T01:34:19.5343912Z ##[endgroup]
2026-08-18T01:34:19.5803349Z [command]"C:\Program Files\Git\cmd\git.exe" log -1 --format=%H
2026-08-18T01:34:19.6097803Z 6a13e365ef15247ffa437c1b204b7af4c1547fb9
2026-08-18T01:34:19.6368073Z ##[group]Run cargo build -p spt --bin translate_proof_fixture
2026-08-18T01:34:19.6368485Z [36;1mcargo build -p spt --bin translate_proof_fixture[0m
2026-08-18T01:34:19.6373027Z shell: C:\Program Files\PowerShell\7\pwsh.EXE -command ". '{0}'"
2026-08-18T01:34:19.6373330Z ##[endgroup]
2026-08-18T01:34:20.9096152Z    Compiling proc-macro2 v1.0.106
2026-08-18T01:34:20.9096541Z    Compiling unicode-ident v1.0.24
2026-08-18T01:34:20.9096860Z    Compiling quote v1.0.45
2026-08-18T01:34:20.9097117Z    Compiling cfg-if v1.0.4
2026-08-18T01:34:20.9776356Z    Compiling serde_core v1.0.228
2026-08-18T01:34:21.0240313Z    Compiling serde v1.0.228
2026-08-18T01:34:21.2460095Z    Compiling windows-link v0.2.1
2026-08-18T01:34:21.4467995Z    Compiling typenum v1.20.1
2026-08-18T01:34:21.4616274Z    Compiling windows-sys v0.61.2
2026-08-18T01:34:22.4100448Z    Compiling getrandom v0.3.4
2026-08-18T01:34:22.5825405Z    Compiling syn v2.0.117
2026-08-18T01:34:23.0487456Z    Compiling portable-atomic v1.13.1
2026-08-18T01:34:23.4556608Z    Compiling pin-project-lite v0.2.17
2026-08-18T01:34:23.6687705Z    Compiling version_check v0.9.5
2026-08-18T01:34:24.6632622Z    Compiling shlex v2.0.1
2026-08-18T01:34:24.8348650Z    Compiling jobserver v0.1.34
2026-08-18T01:34:24.8369356Z    Compiling find-msvc-tools v0.1.9
2026-08-18T01:34:25.1366827Z    Compiling memchr v2.8.1
2026-08-18T01:34:25.6923963Z    Compiling cc v1.2.63
2026-08-18T01:34:26.0635107Z    Compiling critical-section v1.2.0
2026-08-18T01:34:26.1730355Z    Compiling subtle v2.6.1
2026-08-18T01:34:26.2924021Z    Compiling equivalent v1.0.2
2026-08-18T01:34:26.3625627Z    Compiling smallvec v1.15.1
2026-08-18T01:34:26.5294744Z    Compiling futures-core v0.3.32
2026-08-18T01:34:26.7498123Z    Compiling generic-array v0.14.7
2026-08-18T01:34:26.9496926Z    Compiling itoa v1.0.18
2026-08-18T01:34:27.1067429Z    Compiling bytes v1.11.1
2026-08-18T01:34:27.1828294Z    Compiling semver v1.0.28
2026-08-18T01:34:27.4570029Z    Compiling rustc_version v0.4.1
2026-08-18T01:34:27.5531109Z    Compiling serde_derive v1.0.228
2026-08-18T01:34:27.6927396Z    Compiling zeroize_derive v1.4.3
2026-08-18T01:34:28.1638893Z    Compiling zeroize v1.8.2
2026-08-18T01:34:28.2914938Z    Compiling synstructure v0.13.2
2026-08-18T01:34:28.4276883Z    Compiling stable_deref_trait v1.2.1
2026-08-18T01:34:28.5116114Z    Compiling socket2 v0.6.4
2026-08-18T01:34:28.8284626Z    Compiling log v0.4.32
2026-08-18T01:34:28.8776265Z    Compiling zerofrom-derive v0.1.7
2026-08-18T01:34:28.9978992Z    Compiling yoke-derive v0.8.2
2026-08-18T01:34:29.0109006Z    Compiling crypto-common v0.1.7
2026-08-18T01:34:29.1119128Z    Compiling tokio-macros v2.7.0
2026-08-18T01:34:29.6660267Z    Compiling mio v1.2.1
2026-08-18T01:34:29.9430458Z    Compiling zerofrom v0.1.8
2026-08-18T01:34:29.9434907Z    Compiling futures-io v0.3.32
2026-08-18T01:34:30.0831856Z    Compiling futures-sink v0.3.32
2026-08-18T01:34:30.1637817Z    Compiling slab v0.4.12
2026-08-18T01:34:30.1769242Z    Compiling yoke v0.8.3
2026-08-18T01:34:30.3023077Z    Compiling tokio v1.52.3
2026-08-18T01:34:30.5107447Z    Compiling futures-channel v0.3.32
2026-08-18T01:34:30.7159552Z    Compiling futures-macro v0.3.32
2026-08-18T01:34:30.8349164Z    Compiling futures-task v0.3.32
2026-08-18T01:34:31.0031027Z    Compiling hashbrown v0.17.1
2026-08-18T01:34:31.1971243Z    Compiling once_cell v1.21.4
2026-08-18T01:34:31.3531551Z    Compiling rustversion v1.0.22
2026-08-18T01:34:31.4086249Z    Compiling rand_core v0.10.1
2026-08-18T01:34:31.6264247Z    Compiling indexmap v2.14.0
2026-08-18T01:34:31.6528814Z    Compiling futures-util v0.3.32
2026-08-18T01:34:31.7822369Z    Compiling zerovec-derive v0.11.3
2026-08-18T01:34:32.2860063Z    Compiling getrandom v0.2.17
2026-08-18T01:34:32.4287563Z    Compiling cpufeatures v0.2.17
2026-08-18T01:34:32.6649669Z    Compiling zerovec v0.11.6
2026-08-18T01:34:32.9769603Z    Compiling displaydoc v0.2.6
2026-08-18T01:34:33.3741761Z    Compiling hybrid-array v0.4.12
2026-08-18T01:34:33.5459560Z    Compiling fnv v1.0.7
2026-08-18T01:34:33.6328881Z    Compiling getrandom v0.4.2
2026-08-18T01:34:33.8454451Z    Compiling libc v0.2.186
2026-08-18T01:34:34.0965874Z    Compiling cfg_aliases v0.2.1
2026-08-18T01:34:34.1690351Z    Compiling strsim v0.11.1
2026-08-18T01:34:34.4781889Z    Compiling block-buffer v0.12.0
2026-08-18T01:34:34.6292215Z    Compiling crypto-common v0.2.2
2026-08-18T01:34:34.6422240Z    Compiling tinystr v0.8.3
2026-08-18T01:34:34.9680353Z    Compiling tracing-core v0.1.36
2026-08-18T01:34:35.2153394Z    Compiling tracing-attributes v0.1.31
2026-08-18T01:34:35.6350851Z    Compiling writeable v0.6.3
2026-08-18T01:34:35.7143261Z    Compiling litemap v0.8.2
2026-08-18T01:34:35.8343273Z    Compiling autocfg v1.5.1
2026-08-18T01:34:35.8973979Z    Compiling icu_locale_core v2.2.0
2026-08-18T01:34:36.2344127Z    Compiling tracing v0.1.44
2026-08-18T01:34:36.2698920Z    Compiling zerotrie v0.2.4
2026-08-18T01:34:36.6056739Z    Compiling potential_utf v0.1.5
2026-08-18T01:34:36.6143158Z    Compiling cmake v0.1.58
2026-08-18T01:34:36.7539723Z    Compiling ident_case v1.0.1
2026-08-18T01:34:36.9072456Z    Compiling dunce v1.0.5
2026-08-18T01:34:36.9568357Z    Compiling fs_extra v1.3.0
2026-08-18T01:34:37.0845563Z    Compiling icu_properties_data v2.2.0
2026-08-18T01:34:37.2091702Z    Compiling utf8_iter v1.0.4
2026-08-18T01:34:37.3669798Z    Compiling icu_normalizer_data v2.2.0
2026-08-18T01:34:37.5383830Z    Compiling icu_collections v2.2.0
2026-08-18T01:34:38.0268166Z    Compiling aws-lc-sys v0.41.0
2026-08-18T01:34:38.3484327Z    Compiling icu_provider v2.2.0
2026-08-18T01:34:38.6166613Z    Compiling tokio-util v0.7.18
2026-08-18T01:34:39.2314859Z    Compiling percent-encoding v2.3.2
2026-08-18T01:34:39.3996357Z    Compiling icu_normalizer v2.2.0
2026-08-18T01:34:39.9946297Z    Compiling inout v0.2.2
2026-08-18T01:34:40.1067271Z    Compiling http v1.4.1
2026-08-18T01:34:40.1626131Z    Compiling ring v0.17.14
2026-08-18T01:34:40.6927983Z    Compiling cpufeatures v0.3.0
2026-08-18T01:34:40.7780847Z    Compiling thiserror v2.0.18
2026-08-18T01:34:40.9375225Z    Compiling icu_properties v2.2.0
2026-08-18T01:34:41.0678725Z    Compiling aws-lc-rs v1.17.0
2026-08-18T01:34:41.3218036Z    Compiling unicode-segmentation v1.13.3
2026-08-18T01:34:41.7891277Z    Compiling cipher v0.5.2
2026-08-18T01:34:42.0851343Z    Compiling idna_adapter v1.2.2
2026-08-18T01:34:42.2036014Z    Compiling curve25519-dalek-derive v0.1.1
2026-08-18T01:34:42.3125252Z    Compiling thiserror-impl v2.0.18
2026-08-18T01:34:42.6564317Z    Compiling scopeguard v1.2.0
2026-08-18T01:34:42.7708621Z    Compiling lock_api v0.4.14
2026-08-18T01:34:42.9810431Z    Compiling idna v1.1.0
2026-08-18T01:34:43.5942697Z    Compiling chacha20 v0.10.0
2026-08-18T01:34:43.8101150Z    Compiling form_urlencoded v1.2.2
2026-08-18T01:34:43.8560390Z    Compiling ipnet v2.12.0
2026-08-18T01:34:43.8938774Z    Compiling rustls-pki-types v1.14.1
2026-08-18T01:34:43.9781967Z    Compiling block-buffer v0.10.4
2026-08-18T01:34:44.1082341Z    Compiling bitflags v2.12.1
2026-08-18T01:34:44.3457743Z    Compiling winapi v0.3.9
2026-08-18T01:34:44.5844243Z    Compiling untrusted v0.9.0
2026-08-18T01:34:44.6007890Z    Compiling digest v0.10.7
2026-08-18T01:34:44.8970858Z    Compiling url v2.5.8
2026-08-18T01:34:44.9229021Z    Compiling rand v0.10.1
2026-08-18T01:34:45.7205718Z    Compiling darling_core v0.20.11
2026-08-18T01:34:45.8468768Z    Compiling num-traits v0.2.19
2026-08-18T01:34:46.1418659Z    Compiling windows-strings v0.5.1
2026-08-18T01:34:46.5449542Z    Compiling windows-result v0.4.1
2026-08-18T01:34:46.9059059Z    Compiling rustls v0.23.40
2026-08-18T01:34:47.5641004Z    Compiling heck v0.5.0
2026-08-18T01:34:47.9882028Z    Compiling convert_case v0.10.0
2026-08-18T01:34:48.2908558Z    Compiling darling_macro v0.20.11
2026-08-18T01:34:48.3896678Z    Compiling anyhow v1.0.102
2026-08-18T01:34:48.6186364Z    Compiling atomic-waker v1.1.2
2026-08-18T01:34:48.7094107Z    Compiling const-oid v0.10.2
2026-08-18T01:34:48.7222450Z    Compiling unicode-xid v0.2.6
2026-08-18T01:34:49.0511286Z    Compiling derive_more-impl v2.1.1
2026-08-18T01:34:49.3294945Z    Compiling darling v0.20.11
2026-08-18T01:34:49.7822459Z    Compiling zerocopy v0.8.50
2026-08-18T01:34:50.1788678Z    Compiling httparse v1.10.1
2026-08-18T01:34:50.2212068Z    Compiling parking_lot_core v0.9.12
2026-08-18T01:34:50.5530445Z    Compiling derive_builder_core v0.20.2
2026-08-18T01:34:51.1964253Z    Compiling h2 v0.4.14
2026-08-18T01:34:51.7602913Z    Compiling http-body v1.0.1
2026-08-18T01:34:51.9200295Z    Compiling curve25519-dalek v4.1.3
2026-08-18T01:34:52.1875340Z    Compiling ahash v0.8.12
2026-08-18T01:34:52.3486204Z    Compiling derive_more v2.1.1
2026-08-18T01:34:52.3965259Z    Compiling powerfmt v0.2.0
2026-08-18T01:34:52.6399608Z    Compiling either v1.16.0
2026-08-18T01:34:52.6880623Z    Compiling base64ct v1.8.3
2026-08-18T01:34:52.8248954Z    Compiling deranged v0.5.8
2026-08-18T01:34:53.0379378Z    Compiling pem-rfc7468 v1.0.0
2026-08-18T01:34:53.6720737Z    Compiling derive_builder_macro v0.20.2
2026-08-18T01:34:54.3798186Z    Compiling uuid v1.23.2
2026-08-18T01:34:54.8400086Z    Compiling rand_core v0.6.4
2026-08-18T01:34:55.0847879Z    Compiling windows-interface v0.59.3
2026-08-18T01:34:55.6545105Z    Compiling spez v0.1.2
2026-08-18T01:34:55.9634927Z    Compiling n0-error-macros v0.1.3
2026-08-18T01:34:56.0184602Z    Compiling windows-implement v0.60.2
2026-08-18T01:34:56.6781857Z    Compiling num-conv v0.2.2
2026-08-18T01:34:56.6784236Z    Compiling data-encoding v2.11.0
2026-08-18T01:34:56.8284758Z    Compiling base64 v0.22.1
2026-08-18T01:34:56.9959272Z    Compiling try-lock v0.2.5
2026-08-18T01:34:57.3794728Z    Compiling vcpkg v0.2.15
2026-08-18T01:34:57.4572119Z    Compiling pkg-config v0.3.33
2026-08-18T01:34:57.7321991Z    Compiling tower-service v0.3.3
2026-08-18T01:34:57.8133923Z    Compiling tinyvec_macros v0.1.1
2026-08-18T01:34:57.8770817Z    Compiling time-core v0.1.8
2026-08-18T01:34:57.9764498Z    Compiling fastrand v2.4.1
2026-08-18T01:34:58.0189064Z    Compiling zmij v1.0.21
2026-08-18T01:34:58.0520189Z    Compiling libsqlite3-sys v0.30.1
2026-08-18T01:34:58.2208647Z    Compiling tinyvec v1.11.0
2026-08-18T01:34:58.4843115Z    Compiling want v0.3.1
2026-08-18T01:34:58.6189191Z    Compiling n0-error v0.1.3
2026-08-18T01:34:58.6277730Z    Compiling windows-core v0.62.2
2026-08-18T01:34:59.1643680Z    Compiling parking_lot v0.12.5
2026-08-18T01:34:59.5859494Z    Compiling derive_builder v0.20.2
2026-08-18T01:34:59.7071302Z    Compiling der v0.8.0-rc.10
2026-08-18T01:34:59.9407303Z    Compiling sha2 v0.10.9
2026-08-18T01:35:00.3730751Z    Compiling n0-future v0.3.2
2026-08-18T01:35:00.4935391Z    Compiling vergen-lib v9.1.0
2026-08-18T01:35:00.6221540Z    Compiling inout v0.1.4
2026-08-18T01:35:00.7366697Z    Compiling pin-project-internal v1.1.13
2026-08-18T01:35:00.7768220Z    Compiling diatomic-waker v0.2.3
2026-08-18T01:35:00.9453471Z    Compiling parking v2.2.1
2026-08-18T01:35:01.0893562Z    Compiling winnow v1.0.3
2026-08-18T01:35:01.7699044Z    Compiling signature v2.2.0
2026-08-18T01:35:01.9151904Z    Compiling cordyceps v0.3.4
2026-08-18T01:35:02.0077743Z    Compiling windows_x86_64_msvc v0.52.6
2026-08-18T01:35:02.2163168Z    Compiling crossbeam-utils v0.8.21
2026-08-18T01:35:02.2775734Z    Compiling serde_json v1.0.150
2026-08-18T01:35:02.4166554Z    Compiling spt-procident v0.55.0 (C:\actions-runner\_work\spt-bs-core\spt-bs-core\crates\spt-procident)
2026-08-18T01:35:02.4745834Z    Compiling spin v0.10.0
2026-08-18T01:35:02.5164354Z    Compiling httpdate v1.0.3
2026-08-18T01:35:02.5911512Z    Compiling futures-buffered v0.2.13
2026-08-18T01:35:02.6787614Z    Compiling hyper v1.10.1
2026-08-18T01:35:02.7893796Z    Compiling spt-poolguard v0.55.0 (C:\actions-runner\_work\spt-bs-core\spt-bs-core\crates\spt-poolguard)
2026-08-18T01:35:03.0768586Z    Compiling toml_parser v1.1.2+spec-1.1.0
2026-08-18T01:35:03.6129793Z    Compiling ed25519 v2.2.3
2026-08-18T01:35:03.8069323Z    Compiling pin-project v1.1.13
2026-08-18T01:35:03.8112515Z    Compiling spki v0.8.0-rc.4
2026-08-18T01:35:04.0223860Z    Compiling futures-lite v2.6.1
2026-08-18T01:35:04.1123189Z    Compiling cipher v0.4.4
2026-08-18T01:35:04.4128348Z    Compiling hashbrown v0.14.5
2026-08-18T01:35:05.0897117Z    Compiling digest v0.11.3
2026-08-18T01:35:05.1521092Z    Compiling noq-udp v0.10.0
2026-08-18T01:35:05.3734327Z    Compiling vergen-lib v0.1.6
2026-08-18T01:35:05.4727001Z    Compiling vergen v9.1.0
2026-08-18T01:35:05.5835102Z    Compiling universal-hash v0.5.1
2026-08-18T01:35:05.6969851Z    Compiling curve25519-dalek v5.0.0-pre.6
2026-08-18T01:35:05.6992330Z    Compiling heapless v0.7.17
2026-08-18T01:35:06.0152404Z    Compiling sync_wrapper v1.0.2
2026-08-18T01:35:06.0317062Z    Compiling aho-corasick v1.1.4
2026-08-18T01:35:06.1965308Z    Compiling regex-syntax v0.8.10
2026-08-18T01:35:07.0342705Z    Compiling opaque-debug v0.3.1
2026-08-18T01:35:07.1159447Z    Compiling byteorder v1.5.0
2026-08-18T01:35:07.2705041Z    Compiling allocator-api2 v0.2.21
2026-08-18T01:35:07.7825092Z    Compiling toml_datetime v1.1.1+spec-1.1.0
2026-08-18T01:35:08.0111105Z    Compiling toml_edit v0.25.12+spec-1.1.0
2026-08-18T01:35:09.1326663Z    Compiling regex-automata v0.4.14
2026-08-18T01:35:09.4090653Z    Compiling hash32 v0.2.1
2026-08-18T01:35:09.5722609Z    Compiling polyval v0.6.2
2026-08-18T01:35:10.2013545Z    Compiling hashlink v0.9.1
2026-08-18T01:35:10.6422268Z    Compiling hyper-util v0.1.20
2026-08-18T01:35:11.9959855Z    Compiling pkcs8 v0.11.0-rc.10
2026-08-18T01:35:12.2562317Z    Compiling ed25519-dalek v2.2.0
2026-08-18T01:35:12.6124549Z    Compiling spt-store v0.55.0 (C:\actions-runner\_work\spt-bs-core\spt-bs-core\crates\spt-store)
2026-08-18T01:35:12.9273275Z    Compiling prefix-trie v0.8.4
2026-08-18T01:35:13.2673312Z    Compiling spin v0.9.8
2026-08-18T01:35:13.5024581Z    Compiling futures-executor v0.3.32
2026-08-18T01:35:13.6397660Z    Compiling vergen-gitcl v1.0.8
2026-08-18T01:35:13.7052765Z    Compiling windows-threading v0.2.1
2026-08-18T01:35:13.8044875Z    Compiling ryu v1.0.23
2026-08-18T01:35:13.8478697Z    Compiling tower-layer v0.3.3
2026-08-18T01:35:13.8565402Z    Compiling fallible-streaming-iterator v0.1.9
2026-08-18T01:35:14.0608549Z    Compiling fallible-iterator v0.3.0
2026-08-18T01:35:14.1344529Z    Compiling signature v3.0.0
2026-08-18T01:35:14.3295942Z    Compiling ed25519 v3.0.0-rc.4
2026-08-18T01:35:14.3464765Z    Compiling rusqlite v0.32.1
2026-08-18T01:35:14.6487825Z    Compiling data-encoding-macro-internal v0.1.18
2026-08-18T01:35:14.8091258Z    Compiling windows-future v0.3.2
2026-08-18T01:35:15.3011614Z    Compiling futures v0.3.32
2026-08-18T01:35:15.3808180Z    Compiling hickory-proto v0.26.0-beta.4
2026-08-18T01:35:16.0361297Z    Compiling windows-targets v0.52.6
2026-08-18T01:35:16.1209327Z    Compiling spt-proto v0.55.0 (C:\actions-runner\_work\spt-bs-core\spt-bs-core\crates\spt-proto)
2026-08-18T01:35:16.5331887Z    Compiling regex v1.12.3
2026-08-18T01:35:17.7937872Z    Compiling ghash v0.5.1
2026-08-18T01:35:17.8863977Z    Compiling proc-macro-crate v3.5.0
2026-08-18T01:35:18.3460533Z    Compiling sha2 v0.11.0-rc.5
2026-08-18T01:35:19.2138389Z    Compiling ctr v0.9.2
2026-08-18T01:35:19.2146191Z    Compiling aes v0.8.4
2026-08-18T01:35:19.3841178Z    Compiling windows-collections v0.3.2
2026-08-18T01:35:19.7787898Z    Compiling windows-numerics v0.3.1
2026-08-18T01:35:19.7790474Z    Compiling time v0.3.47
2026-08-18T01:35:19.8978894Z    Compiling http-body-util v0.1.3
2026-08-18T01:35:20.0468234Z    Compiling fs2 v0.4.3
2026-08-18T01:35:20.2206932Z    Compiling cobs v0.3.0
2026-08-18T01:35:20.2311113Z    Compiling aead v0.5.2
2026-08-18T01:35:20.3638013Z    Compiling postcard-derive v0.2.2
2026-08-18T01:35:20.4148489Z    Compiling utf8parse v0.2.2
2026-08-18T01:35:20.5552361Z    Compiling ipconfig v0.3.4
2026-08-18T01:35:20.7177027Z    Compiling widestring v1.2.1
2026-08-18T01:35:20.8484035Z    Compiling arrayvec v0.7.6
2026-08-18T01:35:21.0615086Z    Compiling postcard v1.1.3
2026-08-18T01:35:21.6617784Z    Compiling aes-gcm v0.10.3
2026-08-18T01:35:22.0024904Z    Compiling windows v0.62.2
2026-08-18T01:35:22.1377648Z    Compiling ed25519-dalek v3.0.0-pre.6
2026-08-18T01:35:22.5223379Z    Compiling num_enum_derive v0.7.6
2026-08-18T01:35:23.4478246Z    Compiling windows-sys v0.59.0
2026-08-18T01:35:25.9897965Z    Compiling data-encoding-macro v0.1.20
2026-08-18T01:35:26.2536219Z    Compiling tower v0.5.3
2026-08-18T01:35:27.4026294Z    Compiling crossbeam-epoch v0.9.18
2026-08-18T01:35:27.8952320Z    Compiling crossbeam-channel v0.5.15
2026-08-18T01:35:28.7561933Z    Compiling chrono v0.4.45
2026-08-18T01:35:31.1557298Z    Compiling strum_macros v0.28.0
2026-08-18T01:35:34.1711097Z    Compiling iroh-metrics-derive v0.4.1
2026-08-18T01:35:34.8255942Z    Compiling windows-registry v0.6.1
2026-08-18T01:35:35.3702826Z    Compiling memoffset v0.6.5
2026-08-18T01:35:35.9140561Z    Compiling netwatch v0.16.0
2026-08-18T01:35:36.3291919Z    Compiling noq v0.18.0
2026-08-18T01:35:36.4858939Z    Compiling acto v0.8.2
2026-08-18T01:35:36.9881049Z    Compiling async-trait v0.1.89
2026-08-18T01:35:37.0233213Z    Compiling enum-assoc v1.3.0
2026-08-18T01:35:38.1764136Z    Compiling blake3 v1.8.5
2026-08-18T01:35:38.8242310Z    Compiling rustc-hash v2.1.2
2026-08-18T01:35:38.8899404Z    Compiling identity-hash v0.1.0
2026-08-18T01:35:38.9968101Z    Compiling ref-cast v1.0.25
2026-08-18T01:35:39.0747578Z    Compiling mac-addr v0.3.0
2026-08-18T01:35:39.3790911Z    Compiling lru-slab v0.1.2
2026-08-18T01:35:39.4065633Z    Compiling foldhash v0.2.0
2026-08-18T01:35:39.5387229Z    Compiling sorted-index-buffer v0.2.1
2026-08-18T01:35:39.6541945Z    Compiling thiserror v1.0.69
2026-08-18T01:35:39.7002261Z    Compiling tagptr v0.2.0
2026-08-18T01:35:39.9330888Z    Compiling xml-rs v0.8.28
2026-08-18T01:35:40.1763066Z    Compiling moka v0.12.15
2026-08-18T01:35:41.6963069Z    Compiling xmltree v0.10.3
2026-08-18T01:35:42.0465855Z    Compiling hashbrown v0.16.1
2026-08-18T01:35:42.3212547Z    Compiling netdev v0.42.0
2026-08-18T01:35:44.4692573Z    Compiling iroh-metrics v0.38.3
2026-08-18T01:35:44.8922574Z    Compiling strum v0.28.0
2026-08-18T01:35:45.2913990Z    Compiling wmi v0.18.4
2026-08-18T01:35:45.4876301Z    Compiling spt-msg v0.55.0 (C:\actions-runner\_work\spt-bs-core\spt-bs-core\crates\spt-msg)
2026-08-18T01:35:46.9132507Z    Compiling tower-http v0.6.11
2026-08-18T01:35:47.6798256Z    Compiling iroh-base v0.98.0
2026-08-18T01:35:48.0743660Z    Compiling num_enum v0.7.6
2026-08-18T01:35:48.3995300Z    Compiling iroh-relay v0.98.0
2026-08-18T01:35:48.5844367Z    Compiling n0-watcher v0.6.1
2026-08-18T01:35:48.9992993Z    Compiling attohttpc v0.30.1
2026-08-18T01:35:49.2178564Z    Compiling simple-dns v0.9.3
2026-08-18T01:35:49.7727140Z    Compiling tokio-stream v0.1.18
2026-08-18T01:35:50.1601245Z    Compiling serial-core v0.4.0
2026-08-18T01:35:50.3426153Z    Compiling toml_datetime v0.6.11
2026-08-18T01:35:50.6335684Z    Compiling serde_spanned v0.6.9
2026-08-18T01:35:50.7464597Z    Compiling ref-cast-impl v1.0.25
2026-08-18T01:35:50.8246981Z    Compiling thiserror-impl v1.0.69
2026-08-18T01:35:51.2570667Z    Compiling serde_derive_internals v0.29.1
2026-08-18T01:35:51.5939700Z    Compiling simdutf8 v0.1.5
2026-08-18T01:35:51.9048992Z    Compiling arrayref v0.3.9
2026-08-18T01:35:51.9903760Z    Compiling constant_time_eq v0.4.2
2026-08-18T01:35:52.1518405Z    Compiling winreg v0.10.1
2026-08-18T01:35:52.2272609Z    Compiling resolv-conf v0.7.6
2026-08-18T01:35:52.3821661Z    Compiling sha1_smol v1.0.1
2026-08-18T01:35:52.5045076Z    Compiling smol_str v0.1.24
2026-08-18T01:35:52.7125508Z    Compiling toml_write v0.1.2
2026-08-18T01:35:52.8398108Z    Compiling winnow v0.7.15
2026-08-18T01:35:53.1931999Z    Compiling schemars_derive v1.2.1
2026-08-18T01:35:55.1697952Z    Compiling toml_edit v0.22.27
2026-08-18T01:35:55.4174265Z    Compiling serial-windows v0.4.0
2026-08-18T01:35:55.5914269Z    Compiling iroh-dns v0.98.0
2026-08-18T01:35:56.1412784Z    Compiling igd-next v0.17.1
2026-08-18T01:35:58.5349826Z    Compiling lru v0.16.4
2026-08-18T01:35:58.7361590Z    Compiling hmac v0.12.1
2026-08-18T01:35:58.9416371Z    Compiling webpki-roots v1.0.7
2026-08-18T01:35:59.1376399Z    Compiling darling_core v0.23.0
2026-08-18T01:36:00.5145316Z    Compiling seize v0.5.1
2026-08-18T01:36:01.1318634Z    Compiling iroh v0.98.2
2026-08-18T01:36:01.7600595Z    Compiling serde_bytes v0.11.19
2026-08-18T01:36:02.0519313Z    Compiling anstyle v1.0.14
2026-08-18T01:36:02.2256909Z    Compiling cmov v0.5.4
2026-08-18T01:36:02.4155349Z    Compiling bitflags v1.3.2
2026-08-18T01:36:02.4862965Z    Compiling lazy_static v1.5.0
2026-08-18T01:36:02.4897064Z    Compiling pin-utils v0.1.0
2026-08-18T01:36:02.5677911Z    Compiling once_cell_polyfill v1.70.2
2026-08-18T01:36:02.5720557Z    Compiling dyn-clone v1.0.20
2026-08-18T01:36:02.6910607Z    Compiling anstyle-wincon v3.0.11
2026-08-18T01:36:02.7064192Z    Compiling schemars v1.2.1
2026-08-18T01:36:03.1103140Z    Compiling shared_library v0.1.9
2026-08-18T01:36:03.3726635Z    Compiling darling_macro v0.23.0
2026-08-18T01:36:03.6713771Z    Compiling nix v0.25.1
2026-08-18T01:36:03.7693979Z    Compiling ctutils v0.4.2
2026-08-18T01:36:04.0258182Z    Compiling papaya v0.2.4
2026-08-18T01:36:04.0916148Z    Compiling hkdf v0.12.4
2026-08-18T01:36:04.2191571Z    Compiling toml v0.8.23
2026-08-18T01:36:04.4710671Z    Compiling portmapper v0.16.0
2026-08-18T01:36:05.3704090Z    Compiling serial v0.4.0
2026-08-18T01:36:05.5414095Z    Compiling filedescriptor v0.8.3
2026-08-18T01:36:05.7189048Z    Compiling swarm-discovery v0.6.0-alpha.2 (https://github.com/SaberMage/swarm-discovery?rev=89a2200d54a4e3cab2f46cc75ebff49a1fb07614#89a2200d)
2026-08-18T01:36:06.3701642Z    Compiling anstyle-parse v1.0.0
2026-08-18T01:36:06.6360290Z    Compiling backon v1.6.0
2026-08-18T01:36:07.1131543Z    Compiling anstyle-query v1.1.5
2026-08-18T01:36:07.3256429Z    Compiling vte_generate_state_changes v0.1.2
2026-08-18T01:36:07.8997253Z    Compiling shell-words v1.1.1
2026-08-18T01:36:08.1257725Z    Compiling instability v0.3.12
2026-08-18T01:36:08.4199660Z    Compiling downcast-rs v1.2.1
2026-08-18T01:36:08.5367271Z    Compiling unicode-width v0.2.0
2026-08-18T01:36:08.8938032Z    Compiling foldhash v0.1.5
2026-08-18T01:36:09.3260439Z    Compiling colorchoice v1.0.5
2026-08-18T01:36:09.5291742Z    Compiling is_terminal_polyfill v1.70.2
2026-08-18T01:36:09.6507355Z    Compiling paste v1.0.15
2026-08-18T01:36:10.1416447Z    Compiling anstream v1.0.0
2026-08-18T01:36:10.7964479Z    Compiling hashbrown v0.15.5
2026-08-18T01:36:11.4609861Z    Compiling portable-pty v0.8.1
2026-08-18T01:36:11.6802991Z    Compiling vte v0.13.1
2026-08-18T01:36:12.6494102Z    Compiling spt-runtime v0.55.0 (C:\actions-runner\_work\spt-bs-core\spt-bs-core\crates\spt-runtime)
2026-08-18T01:36:12.7462659Z    Compiling spake2 v0.4.0
2026-08-18T01:36:13.1257842Z    Compiling darling v0.23.0
2026-08-18T01:36:13.1258527Z    Compiling itertools v0.13.0
2026-08-18T01:36:13.4682391Z    Compiling crossterm_winapi v0.9.1
2026-08-18T01:36:14.1550565Z    Compiling strum_macros v0.26.4
2026-08-18T01:36:15.6132338Z    Compiling sha1 v0.10.6
2026-08-18T01:36:15.8573431Z    Compiling castaway v0.2.4
2026-08-18T01:36:16.0362913Z    Compiling terminal_size v0.4.4
2026-08-18T01:36:16.2138279Z    Compiling clap_lex v1.1.0
2026-08-18T01:36:16.5821297Z    Compiling unicode-width v0.1.14
2026-08-18T01:36:16.5966901Z    Compiling doctest-file v1.1.1
2026-08-18T01:36:16.8375185Z    Compiling static_assertions v1.1.0
2026-08-18T01:36:17.0574842Z    Compiling recvmsg v1.0.0
2026-08-18T01:36:17.1037807Z    Compiling indoc v2.0.7
2026-08-18T01:36:17.3871588Z    Compiling interprocess v2.4.2
2026-08-18T01:36:18.8017232Z    Compiling compact_str v0.8.2
2026-08-18T01:36:18.9410800Z    Compiling unicode-truncate v1.1.0
2026-08-18T01:36:19.1404658Z    Compiling strum v0.26.3
2026-08-18T01:36:19.4553291Z    Compiling clap_builder v4.6.0
2026-08-18T01:36:19.8680772Z    Compiling spt-live v0.55.0 (C:\actions-runner\_work\spt-bs-core\spt-bs-core\crates\spt-live)
2026-08-18T01:36:21.7102432Z    Compiling crossterm v0.28.1
2026-08-18T01:36:23.3649032Z    Compiling spt-term v0.55.0 (C:\actions-runner\_work\spt-bs-core\spt-bs-core\crates\spt-term)
2026-08-18T01:36:25.5188602Z    Compiling lru v0.12.5
2026-08-18T01:36:26.3040884Z    Compiling clap_derive v4.6.1
2026-08-18T01:36:26.3508538Z    Compiling error-code v3.3.2
2026-08-18T01:36:26.7289963Z    Compiling cassowary v0.3.0
2026-08-18T01:36:27.0452908Z    Compiling clipboard-win v5.4.1
2026-08-18T01:36:27.7371320Z    Compiling ratatui v0.29.0
2026-08-18T01:36:27.9367791Z    Compiling nucleo-matcher v0.3.1
2026-08-18T01:36:28.6853511Z    Compiling clap v4.6.1
2026-08-18T01:36:28.9787116Z    Compiling qrcode v0.14.1
2026-08-18T01:36:42.8276001Z    Compiling rustls-webpki v0.103.13
2026-08-18T01:36:48.3414265Z    Compiling tokio-rustls v0.26.4
2026-08-18T01:36:48.3464382Z    Compiling noq-proto v0.17.0
2026-08-18T01:36:48.3464817Z    Compiling rustls-platform-verifier v0.7.0
2026-08-18T01:36:48.7535310Z    Compiling hickory-net v0.26.0-beta.4
2026-08-18T01:36:48.7562789Z    Compiling hyper-rustls v0.27.9
2026-08-18T01:36:49.0930810Z    Compiling reqwest v0.13.4
2026-08-18T01:36:52.1226611Z    Compiling hickory-resolver v0.26.0-beta.4
2026-08-18T01:36:57.2202333Z    Compiling tokio-websockets v0.13.2
2026-08-18T01:37:24.3580116Z    Compiling spt-net v0.55.0 (C:\actions-runner\_work\spt-bs-core\spt-bs-core\crates\spt-net)
2026-08-18T01:37:27.2005360Z    Compiling spt-daemon v0.55.0 (C:\actions-runner\_work\spt-bs-core\spt-bs-core\crates\spt-daemon)
2026-08-18T01:37:47.6402179Z    Compiling spt v0.55.0 (C:\actions-runner\_work\spt-bs-core\spt-bs-core\crates\spt)
2026-08-18T01:37:48.0330483Z     Finished `dev` profile [unoptimized + debuginfo] target(s) in 3m 28s
2026-08-18T01:37:48.2137111Z ##[group]Run cargo nextest run --workspace -E 'kind(lib) + kind(bin)'
2026-08-18T01:37:48.2137647Z [36;1mcargo nextest run --workspace -E 'kind(lib) + kind(bin)'[0m
2026-08-18T01:37:48.2144110Z shell: C:\Program Files\PowerShell\7\pwsh.EXE -command ". '{0}'"
2026-08-18T01:37:48.2144336Z ##[endgroup]
2026-08-18T01:37:50.9819377Z    Compiling fastrand v2.4.1
2026-08-18T01:37:50.9841041Z    Compiling spt-poolguard v0.55.0 (C:\actions-runner\_work\spt-bs-core\spt-bs-core\crates\spt-poolguard)
2026-08-18T01:37:51.0595105Z    Compiling bytemuck v1.25.2
2026-08-18T01:37:51.0595789Z    Compiling mock-adapter v0.55.0 (C:\actions-runner\_work\spt-bs-core\spt-bs-core\adapters\mock)
2026-08-18T01:37:51.1760872Z    Compiling tempfile v3.27.0
2026-08-18T01:37:51.3285857Z    Compiling futures-lite v2.6.1
2026-08-18T01:37:51.7531162Z    Compiling backon v1.6.0
2026-08-18T01:37:51.8451238Z    Compiling spt-test-support v0.55.0 (C:\actions-runner\_work\spt-bs-core\spt-bs-core\crates\spt-test-support)
2026-08-18T01:37:52.0537470Z    Compiling n0-future v0.3.2
2026-08-18T01:37:52.0569712Z    Compiling rgb v0.8.53
2026-08-18T01:37:52.1684994Z    Compiling n0-watcher v0.6.1
2026-08-18T01:37:52.2001011Z    Compiling iroh-dns v0.98.0
2026-08-18T01:37:52.2594140Z    Compiling spt-store v0.55.0 (C:\actions-runner\_work\spt-bs-core\spt-bs-core\crates\spt-store)
2026-08-18T01:37:52.4190134Z    Compiling netwatch v0.16.0
2026-08-18T01:37:52.4946570Z    Compiling avt v0.18.0
2026-08-18T01:37:52.7713836Z    Compiling iroh-relay v0.98.0
2026-08-18T01:37:53.7404035Z    Compiling portmapper v0.16.0
2026-08-18T01:37:59.0522754Z    Compiling spt-msg v0.55.0 (C:\actions-runner\_work\spt-bs-core\spt-bs-core\crates\spt-msg)
2026-08-18T01:38:00.1171687Z    Compiling spt-term v0.55.0 (C:\actions-runner\_work\spt-bs-core\spt-bs-core\crates\spt-term)
2026-08-18T01:38:03.3250399Z    Compiling spt-runtime v0.55.0 (C:\actions-runner\_work\spt-bs-core\spt-bs-core\crates\spt-runtime)
2026-08-18T01:38:03.5015853Z    Compiling iroh v0.98.2
2026-08-18T01:38:08.5185583Z    Compiling spt-live v0.55.0 (C:\actions-runner\_work\spt-bs-core\spt-bs-core\crates\spt-live)
2026-08-18T01:38:23.3390851Z    Compiling spt-proto v0.55.0 (C:\actions-runner\_work\spt-bs-core\spt-bs-core\crates\spt-proto)
2026-08-18T01:38:23.5145882Z    Compiling spt-procident v0.55.0 (C:\actions-runner\_work\spt-bs-core\spt-bs-core\crates\spt-procident)
2026-08-18T01:38:30.1176264Z    Compiling spt-net v0.55.0 (C:\actions-runner\_work\spt-bs-core\spt-bs-core\crates\spt-net)
2026-08-18T01:38:32.6745005Z    Compiling spt-daemon v0.55.0 (C:\actions-runner\_work\spt-bs-core\spt-bs-core\crates\spt-daemon)
2026-08-18T01:38:57.2278774Z    Compiling spt v0.55.0 (C:\actions-runner\_work\spt-bs-core\spt-bs-core\crates\spt)
2026-08-18T01:40:33.4014545Z    Compiling xtask v0.55.0 (C:\actions-runner\_work\spt-bs-core\spt-bs-core\crates\xtask)
2026-08-18T01:42:17.6425107Z     Finished `test` profile [unoptimized + debuginfo] target(s) in 4m 27s
2026-08-18T01:42:24.5829153Z ────────────
2026-08-18T01:42:24.5829661Z  Nextest run ID 24ec477a-ffc0-47a0-998d-86188e5219bb with nextest profile: default
2026-08-18T01:42:24.5830193Z     Starting 2580 tests across 24 binaries (1 test and 167 binaries skipped)
2026-08-18T01:42:24.6536858Z         PASS [   0.062s] (   1/2580) spt::bin/spt accessview::tests::drill_matches_only_its_own_kind
2026-08-18T01:42:24.6579730Z         PASS [   0.068s] (   2/2580) mock-adapter::bin/capture-player tests::parses_a_well_formed_record
2026-08-18T01:42:24.6702585Z         PASS [   0.080s] (   3/2580) spt::bin/spt accessview::tests::target_roster_groups_types_and_counts_rules
2026-08-18T01:42:24.6750131Z         PASS [   0.085s] (   4/2580) spt::bin/spt api::auth::tests::an_unverifiable_live_owner_never_grants_a_repin
2026-08-18T01:42:24.7035297Z         PASS [   0.113s] (   5/2580) spt::bin/spt api::auth::tests::dead_owner_repin_refused_when_sid_owns_another_perch
2026-08-18T01:42:24.7041062Z         PASS [   0.114s] (   6/2580) spt::bin/spt api::auth::tests::no_proof_is_refused
2026-08-18T01:42:24.7049207Z         PASS [   0.115s] (   7/2580) spt::bin/spt api::auth::tests::dead_owner_repin_refused_when_sid_is_a_psyche_custody_sid
2026-08-18T01:42:24.7060896Z         PASS [   0.116s] (   8/2580) spt::bin/spt accessview::tests::a_pinned_open_renders_apart_from_a_default_open
2026-08-18T01:42:24.7101435Z         PASS [   0.120s] (   9/2580) spt::bin/spt api::auth::tests::mints_distinct_nonempty_tokens
2026-08-18T01:42:24.7146693Z         PASS [   0.125s] (  10/2580) mock-adapter::bin/capture-player tests::refuses_a_length_mismatch
2026-08-18T01:42:24.7208802Z         PASS [   0.131s] (  11/2580) spt::bin/spt api::auth::tests::missing_endpoint_is_no_endpoint
2026-08-18T01:42:24.7211037Z         PASS [   0.131s] (  12/2580) spt::bin/spt api::auth::tests::live_owner_mismatch_still_refuses
2026-08-18T01:42:24.7271957Z         PASS [   0.137s] (  13/2580) spt::bin/spt accessview::tests::node_roster_lists_node_scope_entities_and_mode_exceptions
2026-08-18T01:42:24.7359980Z         PASS [   0.146s] (  14/2580) spt::bin/spt api::auth::tests::pinned_to_dead_sid_mismatched_poll_repins
2026-08-18T01:42:24.7514474Z         PASS [   0.076s] (  15/2580) spt::bin/spt api::auth::tests::worker_missing_is_no_endpoint
2026-08-18T01:42:24.7527345Z         PASS [   0.099s] (  16/2580) spt::bin/spt api::auth::tests::session_id_proof_authenticates
2026-08-18T01:42:24.7728860Z         PASS [   0.115s] (  17/2580) spt::bin/spt api::auth::tests::token_auth_path_unchanged
2026-08-18T01:42:24.7891665Z         PASS [   0.197s] (  18/2580) spt::bin/spt api::auth::tests::dead_owner_repin_still_rescues_a_non_custody_sid
2026-08-18T01:42:24.7892481Z         PASS [   0.117s] (  19/2580) spt::bin/spt api::auth::tests::token_proof_authenticates
2026-08-18T01:42:24.7899479Z         PASS [   0.199s] (  20/2580) spt::bin/spt api::auth::tests::a_recycled_owner_pid_no_longer_blocks_the_dead_owner_rescue
2026-08-18T01:42:24.8004674Z         PASS [   0.097s] (  21/2580) spt::bin/spt api::auth::tests::worker_stored_sid_authenticates
2026-08-18T01:42:24.8125115Z         PASS [   0.108s] (  22/2580) spt::bin/spt api::auth::tests::worker_wrong_sid_and_token_only_refused
2026-08-18T01:42:24.8311691Z         PASS [   0.125s] (  23/2580) spt::bin/spt api::auth::tests::wrong_token_and_wrong_session_refused
2026-08-18T01:42:24.8433479Z         PASS [   0.103s] (  24/2580) spt::bin/spt api::delivery::tests::inject_all_pty_falls_back_to_hook
2026-08-18T01:42:24.8434833Z         PASS [   0.139s] (  25/2580) spt::bin/spt api::auth::tests::worker_parent_current_sid_authenticates_after_rotation
2026-08-18T01:42:24.9062863Z         PASS [   0.191s] (  26/2580) spt::bin/spt api::delivery::tests::echo_gate_explicit_toggle
2026-08-18T01:42:24.9081160Z         PASS [   0.181s] (  27/2580) spt::bin/spt api::delivery::tests::idle_no_gate_does_not_arm_gate
2026-08-18T01:42:24.9085394Z         PASS [   0.198s] (  28/2580) spt::bin/spt api::delivery::tests::an_undated_state_is_dated_by_a_non_edge_report
2026-08-18T01:42:24.9087663Z         PASS [   0.188s] (  29/2580) spt::bin/spt api::delivery::tests::idle_busy_transitions_manage_sentinels
2026-08-18T01:42:24.9106847Z         PASS [   0.159s] (  30/2580) spt::bin/spt api::delivery::tests::inject_resolution_drops_pty_defaults_hook
2026-08-18T01:42:24.9386330Z         PASS [   0.107s] (  31/2580) spt::bin/spt api::engineroom::tests::a_pin_is_not_a_clear
2026-08-18T01:42:24.9428303Z         PASS [   0.104s] (  32/2580) spt::bin/spt api::engineroom::tests::a_refresh_adopts_only_a_real_divergence
2026-08-18T01:42:24.9476089Z         PASS [   0.105s] (  33/2580) spt::bin/spt api::engineroom::tests::an_admin_code_verifies_across_the_ceremony_window_only
2026-08-18T01:42:24.9504479Z         PASS [   0.044s] (  34/2580) spt::bin/spt api::engineroom::tests::subnet_authority_is_the_empowerment_not_the_gate
2026-08-18T01:42:24.9547313Z         PASS [   0.047s] (  35/2580) spt::bin/spt api::engineroom::tests::the_gate_admits_only_the_reserved_id_provisioned_and_authenticated
2026-08-18T01:42:24.9589452Z         PASS [   0.050s] (  36/2580) spt::bin/spt api::engineroom::tests::the_perch_minting_verbs_admit_the_reserved_id_only_as_a_completion
2026-08-18T01:42:24.9713686Z         PASS [   0.033s] (  37/2580) spt::bin/spt api::engineroom::tests::the_unset_echo_names_what_governs_next
2026-08-18T01:42:24.9756968Z         PASS [   0.033s] (  38/2580) spt::bin/spt api::engineroom::tests::the_written_node_mode_is_the_one_the_chain_reads
2026-08-18T01:42:25.1328810Z         PASS [   0.161s] (  39/2580) spt::bin/spt api::reporting::tests::boundary_missing_perch_refused
2026-08-18T01:42:25.2239314Z         PASS [   0.315s] (  40/2580) spt::bin/spt api::engineroom::tests::the_surface_mode_verb_refuses_a_caller_that_is_not_the_engine_room
2026-08-18T01:42:25.2513405Z         PASS [   0.340s] (  41/2580) spt::bin/spt api::engineroom::tests::the_surface_mode_verb_refuses_an_unminted_surface_and_writes_nothing
2026-08-18T01:42:25.2919103Z         PASS [   0.158s] (  42/2580) spt::bin/spt api::reporting::tests::boundary_refuses_rotating_onto_a_psyche_custody_sid
2026-08-18T01:42:25.2924213Z         PASS [   0.539s] (  43/2580) spt::bin/spt api::delivery::tests::only_a_real_state_edge_stamps_the_transition_instant
2026-08-18T01:42:25.3065770Z         PASS [   0.015s] (  44/2580) spt::bin/spt api::reporting::tests::capability_lists_hostable_types
2026-08-18T01:42:25.4128476Z         PASS [   0.692s] (  45/2580) spt::bin/spt api::delivery::tests::idle_drain_peek_returns_non_deferred_rows_only
2026-08-18T01:42:25.4216706Z         PASS [   0.114s] (  46/2580) spt::bin/spt api::reporting::tests::driven_by_reads_daemon_marker
2026-08-18T01:42:25.4230740Z         PASS [   0.131s] (  47/2580) spt::bin/spt api::reporting::tests::digest_entry_validates_and_appends_to_digest_log
2026-08-18T01:42:25.5298830Z         PASS [   0.582s] (  48/2580) spt::bin/spt api::reporting::tests::a_non_engine_room_boundary_never_moves_the_seats_empowerment
2026-08-18T01:42:25.5376014Z         PASS [   0.562s] (  49/2580) spt::bin/spt api::reporting::tests::boundary_rebinds_keeping_anchor
2026-08-18T01:42:25.5376716Z         PASS [   0.737s] (  50/2580) spt::bin/spt api::delivery::tests::poll_only_drains_when_hook_method_present
2026-08-18T01:42:25.5438872Z         PASS [   0.131s] (  51/2580) spt::bin/spt api::reporting::tests::endpoint_info_activity_word_tracks_the_idle_sentinel
2026-08-18T01:42:25.5617026Z         PASS [   0.603s] (  52/2580) spt::bin/spt api::reporting::tests::boundary_appends_to_the_session_ledger
2026-08-18T01:42:25.5620393Z         PASS [   0.771s] (  53/2580) spt::bin/spt api::delivery::tests::poll_drains_non_deferred_by_default
2026-08-18T01:42:25.5686669Z         PASS [   0.142s] (  54/2580) spt::bin/spt api::reporting::tests::endpoint_info_attached_node_from_honest_stamps
2026-08-18T01:42:25.5687484Z         PASS [   0.612s] (  55/2580) spt::bin/spt api::reporting::tests::a_rotated_away_session_id_cannot_resurrect_a_dropped_empowerment
2026-08-18T01:42:25.6016825Z         PASS [   0.071s] (  56/2580) spt::bin/spt api::reporting::tests::endpoint_info_json_always_carries_an_activity_word
2026-08-18T01:42:25.6058084Z         PASS [   0.354s] (  57/2580) spt::bin/spt api::reporting::tests::boundary_with_a_fresh_sid_is_unaffected_by_the_squat_guard
2026-08-18T01:42:25.6059098Z         PASS [   0.182s] (  58/2580) spt::bin/spt api::reporting::tests::endpoint_info_attached_node_self_attributes_own_node_driver
2026-08-18T01:42:25.6195061Z         PASS [   0.061s] (  59/2580) spt::bin/spt api::reporting::tests::filedrops_are_fixed_named_files
2026-08-18T01:42:25.6235239Z         PASS [   0.086s] (  60/2580) spt::bin/spt api::reporting::tests::env_aliases_resolved_from_manifest
2026-08-18T01:42:25.6657923Z         PASS [   0.065s] (  61/2580) spt::bin/spt api::reporting::tests::presence_records_endpoint
2026-08-18T01:42:25.7269569Z         PASS [   0.166s] (  62/2580) spt::bin/spt api::reporting::tests::hint_once_per_session_one_per_message
2026-08-18T01:42:25.7563446Z         PASS [   0.983s] (  63/2580) spt::bin/spt api::delivery::tests::poll_drain_holds_deferred_while_resting_and_releases_once_on_wake
2026-08-18T01:42:25.7578135Z         PASS [   0.970s] (  64/2580) spt::bin/spt api::delivery::tests::poll_drain_suppresses_idle_only_which_reaches_the_relay
2026-08-18T01:42:25.7580942Z         PASS [   0.196s] (  65/2580) spt::bin/spt api::reporting::tests::history_log_appends
2026-08-18T01:42:25.7585648Z         PASS [   0.221s] (  66/2580) spt::bin/spt api::reporting::tests::endpoint_info_reports_and_refuses
2026-08-18T01:42:25.7592713Z         PASS [   0.196s] (  67/2580) spt::bin/spt api::reporting::tests::misplaced_drop_is_still_found_once_the_anchor_is_correct
2026-08-18T01:42:25.7715166Z         PASS [   0.984s] (  68/2580) spt::bin/spt api::delivery::tests::poll_drain_validates_notify_copies_against_their_rows
2026-08-18T01:42:25.7722552Z         PASS [   0.960s] (  69/2580) spt::bin/spt api::engineroom::tests::a_non_engine_room_attempt_never_touches_the_empower_ledger
2026-08-18T01:42:25.7810511Z         PASS [   0.023s] (  70/2580) spt::bin/spt api::tests::adapter_is_optional
2026-08-18T01:42:25.7900282Z         PASS [   0.034s] (  71/2580) spt::bin/spt api::startup::tests::a_dead_binder_pid_proves_nothing_and_never_drops_the_stamp
2026-08-18T01:42:25.8127950Z         PASS [   0.053s] (  72/2580) spt::bin/spt api::tests::ctx_manifest_unregistered_no_manifest_is_none_not_fatal
2026-08-18T01:42:25.8128874Z         PASS [   0.055s] (  73/2580) spt::bin/spt api::tests::ctx_manifest_override_wins_when_manifest_present
2026-08-18T01:42:25.8321667Z         PASS [   0.060s] (  74/2580) spt::bin/spt api::tests::state_value_is_validated
2026-08-18T01:42:25.8388146Z         PASS [   0.067s] (  75/2580) spt::bin/spt api::tests::load_manifest_resolves_composite_adapter_option
2026-08-18T01:42:25.8440448Z         PASS [   0.299s] (  76/2580) spt::bin/spt api::reporting::tests::erase_unregisters_regardless_of_liveness
2026-08-18T01:42:25.8561999Z         PASS [   0.235s] (  77/2580) spt::bin/spt api::reporting::tests::session_end_erase_wipes_childless_perch
2026-08-18T01:42:25.8565787Z         PASS [   0.096s] (  78/2580) spt::bin/spt api::tests::ctx_manifest_resolves_from_registry_when_manifest_absent
2026-08-18T01:42:25.8566375Z         PASS [   0.075s] (  79/2580) spt::bin/spt api::tests::surface_parses
2026-08-18T01:42:25.8566939Z         PASS [   0.190s] (  80/2580) spt::bin/spt api::reporting::tests::soft_end_preserves_a_live_listeners_address
2026-08-18T01:42:25.8569847Z         PASS [   0.233s] (  81/2580) spt::bin/spt api::reporting::tests::session_end_soft_preserves_state
2026-08-18T01:42:25.8624330Z         PASS [   0.071s] (  82/2580) spt::bin/spt api::startup::tests::a_dead_relays_capability_stamp_is_not_resurrected_by_a_listener_rebind
2026-08-18T01:42:25.9107877Z         PASS [   0.952s] (  83/2580) spt::bin/spt api::reporting::tests::boundary_injects_deferred_shell_context
2026-08-18T01:42:25.9397064Z         PASS [   0.715s] (  84/2580) spt::bin/spt api::reporting::tests::boundary_resurfaces_undismissed_notifs
2026-08-18T01:42:25.9511720Z         PASS [   0.138s] (  85/2580) spt::bin/spt api::worker::tests::cascade_guard_tracks_live_children
2026-08-18T01:42:25.9657101Z         PASS [   0.361s] (  86/2580) spt::bin/spt api::reporting::tests::session_end_erase_reaps_stale_worker_then_proceeds
2026-08-18T01:42:25.9675137Z         PASS [   0.362s] (  87/2580) spt::bin/spt api::reporting::tests::session_end_erase_refused_with_live_children
2026-08-18T01:42:25.9680725Z         PASS [   0.241s] (  88/2580) spt::bin/spt api::reporting::tests::soft_end_still_cleans_a_dead_listeners_address
2026-08-18T01:42:25.9734013Z         PASS [   0.117s] (  89/2580) spt::bin/spt cli::lifecycle_verb_decisions::remembered_defaults_prefer_the_newest_row_field_by_field
2026-08-18T01:42:25.9759936Z         PASS [   0.120s] (  90/2580) spt::bin/spt cli::lifecycle_verb_decisions::the_adapter_precedence_is_flag_then_endpoint_then_a_sole_installed_one
2026-08-18T01:42:25.9838345Z         PASS [   0.127s] (  91/2580) spt::bin/spt cli::lifecycle_verb_decisions::the_go_ladder_takes_the_ratified_rung
2026-08-18T01:42:25.9921124Z         PASS [   0.179s] (  92/2580) spt::bin/spt api::worker::tests::guard_clears_only_when_all_children_stopped
2026-08-18T01:42:25.9965593Z         PASS [   0.086s] (  93/2580) spt::bin/spt cli::reserved_id_tests::endpoint_run_refuses_the_reserved_id_and_saves_nothing
2026-08-18T01:42:26.0105935Z         PASS [   0.045s] (  94/2580) spt::bin/spt cli::resume_resolution_tests::resume_never_feeds_a_provisional
2026-08-18T01:42:26.0174721Z         PASS [   0.050s] (  95/2580) spt::bin/spt cli::retired_verb_pre_scan::the_pre_scan_reads_the_verb_position_only
2026-08-18T01:42:26.0268436Z         PASS [   0.059s] (  96/2580) spt::bin/spt cli::retired_verb_pre_scan::the_retired_verb_refuses_with_a_pointer_a_generic_error_cannot_fake
2026-08-18T01:42:26.0269539Z         PASS [   0.053s] (  97/2580) spt::bin/spt cli::run_home_tests::order_by_mru_orders_guidance
2026-08-18T01:42:26.0311425Z         PASS [   0.055s] (  98/2580) spt::bin/spt cli::run_home_tests::run_home_resolution_matrix
2026-08-18T01:42:26.0374753Z         PASS [   0.052s] (  99/2580) spt::bin/spt cli::run_on_live_tests::run_on_live_never_duplicates_and_create_conflicts
2026-08-18T01:42:26.0531322Z         PASS [   0.056s] ( 100/2580) spt::bin/spt cli::tests::a_mint_captures_its_declared_mode_and_nothing_else
2026-08-18T01:42:26.0562671Z         PASS [   0.202s] ( 101/2580) spt::bin/spt api::worker::tests::worker_start_nests_under_parent
2026-08-18T01:42:26.0824922Z         PASS [   0.055s] ( 102/2580) spt::bin/spt cli::tests::a_notfound_lands_locally_only_when_the_target_is_an_endpoint_here
2026-08-18T01:42:26.0968732Z         PASS [   0.146s] ( 103/2580) spt::bin/spt cli::reserved_id_tests::the_lifecycle_verbs_refuse_their_preconditions
2026-08-18T01:42:26.1002746Z         PASS [   0.245s] ( 104/2580) spt::bin/spt api::worker::tests::worker_start_registration_sid_falls_back_to_presented
2026-08-18T01:42:26.1006958Z         PASS [   0.074s] ( 105/2580) spt::bin/spt cli::tests::a_one_way_approval_hands_over_a_reverse_command_that_parses
2026-08-18T01:42:26.1017920Z         PASS [   0.259s] ( 106/2580) spt::bin/spt api::worker::tests::worker_start_mints_id_stores_parent_sid_and_metadata
2026-08-18T01:42:26.1074705Z         PASS [   0.071s] ( 107/2580) spt::bin/spt cli::tests::a_remote_send_receive_claims_only_what_it_can_deliver
2026-08-18T01:42:26.1130970Z         PASS [   0.060s] ( 108/2580) spt::bin/spt cli::tests::a_reply_carried_request_is_not_stamped_as_a_first_order_knock
2026-08-18T01:42:26.1180284Z         PASS [   0.063s] ( 109/2580) spt::bin/spt cli::tests::a_retired_flag_names_what_replaced_it
2026-08-18T01:42:26.1186693Z         PASS [   0.101s] ( 110/2580) spt::bin/spt cli::tests::a_non_attributable_bake_needs_the_acknowledgment_and_keeps_it
2026-08-18T01:42:26.1232269Z         PASS [   0.041s] ( 111/2580) spt::bin/spt cli::tests::a_row_without_a_node_says_so_and_one_with_a_node_shows_it
2026-08-18T01:42:26.1295628Z         PASS [   0.137s] ( 112/2580) spt::bin/spt cli::tests::a_local_hit_never_asks_the_broker
2026-08-18T01:42:26.1296242Z         PASS [   0.033s] ( 113/2580) spt::bin/spt cli::tests::a_rule_describes_itself_in_plain_words
2026-08-18T01:42:26.1365885Z         PASS [   0.036s] ( 114/2580) spt::bin/spt cli::tests::a_sealed_codes_subnet_is_chosen_and_never_guessed
2026-08-18T01:42:26.1410942Z         PASS [   0.040s] ( 115/2580) spt::bin/spt cli::tests::a_sender_rule_on_a_non_attributable_surface_is_refused
2026-08-18T01:42:26.1425574Z         PASS [   0.132s] ( 116/2580) spt::bin/spt cli::tests::a_minted_sealed_code_is_the_one_that_opens_to_its_record
2026-08-18T01:42:26.1463834Z         PASS [   0.044s] ( 117/2580) spt::bin/spt cli::tests::a_status_row_reads_held_over_running_and_carries_its_evidence
2026-08-18T01:42:26.1567232Z         PASS [   0.047s] ( 118/2580) spt::bin/spt cli::tests::a_subcommand_name_beats_the_bare_target
2026-08-18T01:42:26.1750687Z         PASS [   0.062s] ( 119/2580) spt::bin/spt cli::tests::a_subnet_fork_grant_names_the_members_that_cannot_resolve
2026-08-18T01:42:26.2637438Z         PASS [   0.139s] ( 120/2580) spt::bin/spt cli::tests::access_subcommands_parse
2026-08-18T01:42:26.2657705Z         PASS [   0.419s] ( 121/2580) spt::bin/spt api::worker::tests::worker_poll_holds_deferred_while_resting
2026-08-18T01:42:26.2896259Z         PASS [   0.164s] ( 122/2580) spt::bin/spt cli::tests::adapter_add_transport_flags_parse
2026-08-18T01:42:26.3180593Z         PASS [   0.197s] ( 123/2580) spt::bin/spt cli::tests::a_wedged_probe_costs_one_ceiling_and_reads_unknown_not_offline
2026-08-18T01:42:26.3311107Z         PASS [   0.187s] ( 124/2580) spt::bin/spt cli::tests::adapter_name_validation_flags_every_unknown
2026-08-18T01:42:26.4072311Z         PASS [   0.249s] ( 125/2580) spt::bin/spt cli::tests::adapter_names_comma_list_parses_and_refuses_empties
2026-08-18T01:42:26.4212565Z         PASS [   0.087s] ( 126/2580) spt::bin/spt cli::tests::adapter_update_install_dir_is_registered_source_dir_not_repo_name
2026-08-18T01:42:26.4255628Z         PASS [   0.144s] ( 127/2580) spt::bin/spt cli::tests::adapter_subcommands_parse
2026-08-18T01:42:26.4461239Z         PASS [   0.287s] ( 128/2580) spt::bin/spt cli::tests::adapter_has_live_endpoint_detects_matching_live_perch
2026-08-18T01:42:26.4461964Z         PASS [   0.269s] ( 129/2580) spt::bin/spt cli::tests::adapter_profile_verbs_local_only
2026-08-18T01:42:26.4468127Z         PASS [   0.591s] ( 130/2580) spt::bin/spt api::worker::tests::worker_poll_drains_spool
2026-08-18T01:42:26.4468566Z         PASS [   0.252s] ( 131/2580) spt::bin/spt cli::tests::adapter_string_verbs
2026-08-18T01:42:26.4471304Z         PASS [   0.115s] ( 132/2580) spt::bin/spt cli::tests::adapter_update_notice_absent_when_no_message
2026-08-18T01:42:26.4501928Z         PASS [   0.588s] ( 133/2580) spt::bin/spt api::startup::tests::a_listener_over_a_dead_pty_is_not_offlined_by_the_liveness_reconcile
2026-08-18T01:42:26.4536315Z         PASS [   0.057s] ( 134/2580) spt::bin/spt cli::tests::adapter_update_notice_renders_declared_message_markdown
2026-08-18T01:42:26.4564889Z         PASS [   0.054s] ( 135/2580) spt::bin/spt cli::tests::adapter_update_summary_and_exit_aggregate_isolated_failures
2026-08-18T01:42:26.4572734Z         PASS [   0.170s] ( 136/2580) spt::bin/spt cli::tests::adapter_translate_proof_parses
2026-08-18T01:42:26.4881832Z         PASS [   0.083s] ( 137/2580) spt::bin/spt cli::tests::adapter_use_sets_and_clears_pointer
2026-08-18T01:42:26.5002328Z         PASS [   0.356s] ( 138/2580) spt::bin/spt cli::tests::adapter_has_live_endpoint_false_for_other_or_dead
2026-08-18T01:42:26.5333207Z         PASS [   0.108s] ( 139/2580) spt::bin/spt cli::tests::agent_ground_describes_itself_exactly_as_the_ceremony_always_did
2026-08-18T01:42:26.5387379Z         PASS [   0.112s] ( 140/2580) spt::bin/spt cli::tests::all_hidden_this_node_suppresses_no_perches_marker
2026-08-18T01:42:26.5493015Z         PASS [   0.125s] ( 141/2580) spt::bin/spt cli::tests::adapter_version_parses
2026-08-18T01:42:26.5620713Z         PASS [   0.135s] ( 142/2580) spt::bin/spt cli::tests::adapter_version_surfaces_declared_adapter_version
2026-08-18T01:42:26.5824183Z         PASS [   0.110s] ( 143/2580) spt::bin/spt cli::tests::an_approval_binds_the_subject_the_knocks_origin_implies
2026-08-18T01:42:26.5892201Z         PASS [   0.143s] ( 144/2580) spt::bin/spt cli::tests::already_applied_message_reads_up_to_date_no_restart
2026-08-18T01:42:26.5919794Z         PASS [   0.139s] ( 145/2580) spt::bin/spt cli::tests::an_addressed_target_is_local_only_when_its_node_half_names_this_node
2026-08-18T01:42:26.5955422Z         PASS [   0.108s] ( 146/2580) spt::bin/spt cli::tests::an_empty_unlisted_set_renders_no_heading_at_all
2026-08-18T01:42:26.5988705Z         PASS [   0.067s] ( 147/2580) spt::bin/spt cli::tests::an_excluded_knock_is_neither_a_landing_nor_a_wire_refusal
2026-08-18T01:42:26.6035126Z         PASS [   0.145s] ( 148/2580) spt::bin/spt cli::tests::an_empty_stored_surface_list_still_means_every_surface
2026-08-18T01:42:26.6074995Z         PASS [   0.158s] ( 149/2580) spt::bin/spt api::startup::tests::a_live_owner_whose_birth_matches_still_refuses_the_bind
2026-08-18T01:42:26.6090483Z         PASS [   0.070s] ( 150/2580) spt::bin/spt cli::tests::an_undelivered_receipt_reports_only_the_receipt
2026-08-18T01:42:26.6224762Z         PASS [   0.074s] ( 151/2580) spt::bin/spt cli::tests::answering_verbs_declare_no_directionality
2026-08-18T01:42:26.6757160Z         PASS [   0.117s] ( 152/2580) spt::bin/spt cli::tests::any_single_evidence_source_is_enough_and_only_nothing_refuses
2026-08-18T01:42:26.6949094Z         PASS [   0.126s] ( 153/2580) spt::bin/spt cli::tests::api_adapter_flag_is_group_level_not_post_subcommand
2026-08-18T01:42:26.6996273Z         PASS [   0.106s] ( 154/2580) spt::bin/spt cli::tests::applied_message_appends_restart_required_notice
2026-08-18T01:42:26.7286743Z         PASS [   0.107s] ( 155/2580) spt::bin/spt cli::tests::applied_message_renders_semver_or_counter_fallback_and_states_applied
2026-08-18T01:42:26.7572454Z         PASS [   0.165s] ( 156/2580) spt::bin/spt cli::tests::api_listen_accepts_session_id_flag
2026-08-18T01:42:26.7707703Z         PASS [   0.147s] ( 157/2580) spt::bin/spt cli::tests::bare_tty_guard
2026-08-18T01:42:26.7744877Z         PASS [   0.171s] ( 158/2580) spt::bin/spt cli::tests::apply_user_msg_gate_local_origination
2026-08-18T01:42:26.7887583Z         PASS [   0.090s] ( 159/2580) spt::bin/spt cli::tests::broker_image_line_reports_without_warning_or_remedy
2026-08-18T01:42:26.7888302Z         PASS [   0.180s] ( 160/2580) spt::bin/spt cli::tests::bare_spt_parses_to_none
2026-08-18T01:42:26.7918489Z         PASS [   0.116s] ( 161/2580) spt::bin/spt cli::tests::bare_update_parses_composite_flags
2026-08-18T01:42:26.7947839Z         PASS [   0.102s] ( 162/2580) spt::bin/spt cli::tests::both_knock_answer_surfaces_take_a_monic
2026-08-18T01:42:26.8895156Z         PASS [   0.282s] ( 163/2580) spt::bin/spt api::startup::tests::a_recycled_owner_pid_no_longer_refuses_the_bind
2026-08-18T01:42:26.8920346Z         PASS [   0.118s] ( 164/2580) spt::bin/spt cli::tests::cli_send_stamps_cli_at_node_origin
2026-08-18T01:42:26.8991207Z         PASS [   0.110s] ( 165/2580) spt::bin/spt cli::tests::connection_lines_net_less_hides_stale_heartbeat
2026-08-18T01:42:26.9072420Z         PASS [   0.154s] ( 166/2580) spt::bin/spt cli::tests::classify_flat_archive_never_misfires
2026-08-18T01:42:26.9145966Z         PASS [   0.139s] ( 167/2580) spt::bin/spt cli::tests::classify_multiplatform_captures_only_known_triples
2026-08-18T01:42:26.9176327Z         PASS [   0.128s] ( 168/2580) spt::bin/spt cli::tests::composite_plans_core_first_and_core_only_skips_adapters
2026-08-18T01:42:26.9178294Z         PASS [   0.126s] ( 169/2580) spt::bin/spt cli::tests::coordinator_image_line_is_the_only_stale_warning
2026-08-18T01:42:26.9250998Z         PASS [   0.223s] ( 170/2580) spt::bin/spt cli::tests::classify_fetch_reject_matrix
2026-08-18T01:42:26.9275625Z         PASS [   0.133s] ( 171/2580) spt::bin/spt cli::tests::create_existing_name_is_usage_error
2026-08-18T01:42:26.9400930Z         PASS [   0.806s] ( 172/2580) spt::bin/spt cli::tests::adapter_digest_proof_fills_session_id_key
2026-08-18T01:42:26.9664893Z         PASS [   0.833s] ( 173/2580) spt::bin/spt cli::tests::adapter_digest_proof_gates_on_drops
2026-08-18T01:42:26.9743051Z         PASS [   0.075s] ( 174/2580) spt::bin/spt cli::tests::create_mode_is_never_preselected
2026-08-18T01:42:26.9743937Z         PASS [   0.083s] ( 175/2580) spt::bin/spt cli::tests::create_mints_two_distinct_keys_and_records_the_mode
2026-08-18T01:42:26.9809541Z         PASS [   0.074s] ( 176/2580) spt::bin/spt cli::tests::create_new_existing_name_is_usage_error
2026-08-18T01:42:26.9868719Z         PASS [   0.069s] ( 177/2580) spt::bin/spt cli::tests::create_not_elevated_refuses_without_saving
2026-08-18T01:42:27.0096942Z         PASS [   0.099s] ( 178/2580) spt::bin/spt cli::tests::create_new_mints_shows_and_requests_save
2026-08-18T01:42:27.0115634Z         PASS [   0.083s] ( 179/2580) spt::bin/spt cli::tests::cross_node_after_filters_a_sealed_turn_exactly_like_the_local_path
2026-08-18T01:42:27.0116750Z         PASS [   0.076s] ( 180/2580) spt::bin/spt cli::tests::daemon_offline_hint_only_when_down
2026-08-18T01:42:27.0130021Z         PASS [   0.095s] ( 181/2580) spt::bin/spt cli::tests::create_prints_joining_material_when_elevated
2026-08-18T01:42:27.0181968Z         PASS [   0.056s] ( 182/2580) spt::bin/spt cli::tests::daemon_refresh_verb_parses
2026-08-18T01:42:27.0318996Z         PASS [   0.058s] ( 183/2580) spt::bin/spt cli::tests::daemon_subcommands_parse
2026-08-18T01:42:27.0400720Z         PASS [   0.115s] ( 184/2580) spt::bin/spt cli::tests::create_provisions_the_admin_key_and_show_code_never_does
2026-08-18T01:42:27.0434733Z         PASS [   0.154s] ( 185/2580) spt::bin/spt api::startup::tests::a_recycled_relay_pid_is_fixed_too_so_the_role_gate_is_not_carrying_this
2026-08-18T01:42:27.0462441Z         PASS [   0.447s] ( 186/2580) spt::bin/spt cli::tests::apply_release_crc_swap_only_swaps_changed
2026-08-18T01:42:27.0770445Z         PASS [   0.103s] ( 187/2580) spt::bin/spt cli::tests::daemonless_apply_message_points_at_finish_or_start
2026-08-18T01:42:27.0813844Z         PASS [   0.101s] ( 188/2580) spt::bin/spt cli::tests::deferred_elevation_gate_matrix
2026-08-18T01:42:27.0890518Z         PASS [   0.102s] ( 189/2580) spt::bin/spt cli::tests::digest_cursor_flags_parse
2026-08-18T01:42:27.0944469Z         PASS [   0.086s] ( 190/2580) spt::bin/spt cli::tests::digest_flag_defaults
2026-08-18T01:42:27.0960668Z         PASS [   1.157s] ( 191/2580) spt::bin/spt cli::reserved_id_tests::rename_into_the_reserved_id_is_refused
2026-08-18T01:42:27.0977810Z         PASS [   0.087s] ( 192/2580) spt::bin/spt cli::tests::digest_human_path_keeps_the_stderr_trailer
2026-08-18T01:42:27.1021132Z         PASS [   0.091s] ( 193/2580) spt::bin/spt cli::tests::digest_json_carries_version_and_leaves_stderr_clean
2026-08-18T01:42:27.1069710Z         PASS [   0.094s] ( 194/2580) spt::bin/spt cli::tests::digest_json_predates_path_still_carries_version
2026-08-18T01:42:27.1112714Z         PASS [   0.093s] ( 195/2580) spt::bin/spt cli::tests::empty_store_no_flag_guides_to_pair_or_create
2026-08-18T01:42:27.1168158Z         PASS [   0.085s] ( 196/2580) spt::bin/spt cli::tests::endpoint_caller_is_denied_and_a_human_caller_is_not
2026-08-18T01:42:27.1415897Z         PASS [   0.064s] ( 197/2580) spt::bin/spt cli::tests::endpoint_row_json_endpoint_type_is_additive
2026-08-18T01:42:27.1508105Z         PASS [   0.103s] ( 198/2580) spt::bin/spt cli::tests::endpoint_role_parses
2026-08-18T01:42:27.1704410Z         PASS [   0.075s] ( 199/2580) spt::bin/spt cli::tests::engine_room_ceremony_decision_table
2026-08-18T01:42:27.1802742Z         PASS [   0.084s] ( 200/2580) spt::bin/spt cli::tests::engine_room_purge_resets_under_elevation_and_refuses_without_it
2026-08-18T01:42:27.1867314Z         PASS [   0.089s] ( 201/2580) spt::bin/spt cli::tests::escalation_choice_parses_fail_closed
2026-08-18T01:42:27.1996238Z         PASS [   0.096s] ( 202/2580) spt::bin/spt cli::tests::every_mint_persist_site_asks_the_shared_probe
2026-08-18T01:42:27.2030396Z         PASS [   0.113s] ( 203/2580) spt::bin/spt cli::tests::endpoint_subcommands_parse
2026-08-18T01:42:27.2129936Z         PASS [   0.096s] ( 204/2580) spt::bin/spt cli::tests::every_send_outcome_is_answered_by_exactly_one_renderer
2026-08-18T01:42:27.2291497Z         PASS [   0.118s] ( 205/2580) spt::bin/spt cli::tests::every_read_status_command_accepts_the_global_json_flag
2026-08-18T01:42:27.2385102Z         PASS [   0.131s] ( 206/2580) spt::bin/spt cli::tests::every_node_subcommand_parses_identically_under_the_daemon_alias
2026-08-18T01:42:27.3325635Z         PASS [   0.251s] ( 207/2580) spt::bin/spt cli::tests::endpoint_stop_marks_offline
2026-08-18T01:42:27.3327945Z         PASS [   0.146s] ( 208/2580) spt::bin/spt cli::tests::filter_after_excludes_at_or_below_cursor
2026-08-18T01:42:27.3355727Z         PASS [   0.155s] ( 209/2580) spt::bin/spt cli::tests::fetch_reject_action_apply_decision
2026-08-18T01:42:27.3466435Z         PASS [   0.146s] ( 210/2580) spt::bin/spt cli::tests::filter_after_predates_window_returns_full
2026-08-18T01:42:27.3467111Z         PASS [   0.143s] ( 211/2580) spt::bin/spt cli::tests::finish_message_states_fully_live_no_manual_restart
2026-08-18T01:42:27.3501873Z         PASS [   0.306s] ( 212/2580) spt::bin/spt api::startup::tests::api_bind_admits_the_reserved_id_only_as_a_bring_ups_completion
2026-08-18T01:42:27.3597565Z         PASS [   0.129s] ( 213/2580) spt::bin/spt cli::tests::gh_download_command_no_tag_omits_tag
2026-08-18T01:42:27.3609760Z         PASS [   0.122s] ( 214/2580) spt::bin/spt cli::tests::gh_download_command_with_tag_shape
2026-08-18T01:42:27.3669770Z         PASS [   0.035s] ( 215/2580) spt::bin/spt cli::tests::gh_release_version_compare_decision
2026-08-18T01:42:27.3681208Z         PASS [   0.034s] ( 216/2580) spt::bin/spt cli::tests::gh_failure_classes_render_os_correct_hints
2026-08-18T01:42:27.3950684Z         PASS [   0.246s] ( 217/2580) spt::bin/spt cli::tests::extract_multiplatform_missing_my_triple_is_typed_rejection
2026-08-18T01:42:27.4227072Z         PASS [   0.925s] ( 218/2580) spt::bin/spt cli::tests::an_engine_room_reset_wipes_records_but_never_deletes_the_engine_room
2026-08-18T01:42:27.4295360Z         PASS [   0.092s] ( 219/2580) spt::bin/spt cli::tests::gh_version_command_shape
2026-08-18T01:42:27.4419928Z         PASS [   0.098s] ( 220/2580) spt::bin/spt cli::tests::grant_subcommands_parse
2026-08-18T01:42:27.4551323Z         PASS [   0.110s] ( 221/2580) spt::bin/spt cli::tests::help_groups_cover_every_command
2026-08-18T01:42:27.4612056Z         PASS [   0.319s] ( 222/2580) spt::bin/spt cli::tests::extract_legacy_flat_stays_flat
2026-08-18T01:42:27.4971075Z         PASS [   0.327s] ( 223/2580) spt::bin/spt cli::tests::extract_multiplatform_places_shared_root_and_flattens_my_triple
2026-08-18T01:42:27.8169713Z         PASS [   0.458s] ( 224/2580) spt::bin/spt cli::tests::hot_path_flat_and_moved_verbs_gone
2026-08-18T01:42:27.8490883Z         PASS [   0.482s] ( 225/2580) spt::bin/spt cli::tests::inbound_json_speaks_in_the_two_states_the_human_view_is_silent_in
2026-08-18T01:42:27.8498305Z         PASS [   0.489s] ( 226/2580) spt::bin/spt cli::tests::how_to_topics_cover_ready_and_send
2026-08-18T01:42:27.8540216Z         PASS [   0.486s] ( 227/2580) spt::bin/spt cli::tests::inbound_verdict_rides_the_json_in_every_state_including_ok
2026-08-18T01:42:27.8656495Z         PASS [   0.443s] ( 228/2580) spt::bin/spt cli::tests::install_platform_check_gates_stamp_and_host_arch
2026-08-18T01:42:27.8716034Z         PASS [   0.476s] ( 229/2580) spt::bin/spt cli::tests::install_place_is_idempotent_and_path_block_detected
2026-08-18T01:42:27.8741884Z         PASS [   0.446s] ( 230/2580) spt::bin/spt cli::tests::instance_rows_palette_and_align
2026-08-18T01:42:27.8780120Z         PASS [   0.436s] ( 231/2580) spt::bin/spt cli::tests::instance_rows_project_column
2026-08-18T01:42:27.8884507Z         PASS [   0.432s] ( 232/2580) spt::bin/spt cli::tests::invalid_usage_errors
2026-08-18T01:42:27.8895815Z         PASS [   0.428s] ( 233/2580) spt::bin/spt cli::tests::join_gate_refuses_without_confirmed_elevation
2026-08-18T01:42:27.8964855Z         PASS [   0.399s] ( 234/2580) spt::bin/spt cli::tests::json_activity_key_is_local_only_and_skips_when_unknown
2026-08-18T01:42:27.9119113Z         PASS [   0.093s] ( 235/2580) spt::bin/spt cli::tests::json_activity_words_come_from_the_shared_vocabulary_source
2026-08-18T01:42:27.9123832Z         PASS [   0.063s] ( 236/2580) spt::bin/spt cli::tests::json_payload_rides_as_attr_alongside_body
2026-08-18T01:42:27.9601419Z         PASS [   0.103s] ( 237/2580) spt::bin/spt cli::tests::knock_surfaces_speaks_the_tables_vocabulary_and_refuses_the_rest
2026-08-18T01:42:27.9776300Z         PASS [   0.096s] ( 238/2580) spt::bin/spt cli::tests::malformed_tuple_flags_refuse_with_a_usable_diagnostic
2026-08-18T01:42:27.9797969Z         PASS [   0.092s] ( 239/2580) spt::bin/spt cli::tests::new_code_carries_the_acknowledgment_and_the_subnet_through_the_router
2026-08-18T01:42:27.9812766Z         PASS [   0.103s] ( 240/2580) spt::bin/spt cli::tests::multi_subnet_refuses_without_flag_then_resolves_with_it
2026-08-18T01:42:27.9828304Z         PASS [   0.117s] ( 241/2580) spt::bin/spt cli::tests::local_dtos_carry_host_error_and_omit_it_when_clean
2026-08-18T01:42:27.9849491Z         PASS [   0.135s] ( 242/2580) spt::bin/spt cli::tests::json_project_field_skip_if_none
2026-08-18T01:42:28.0002738Z         PASS [   0.126s] ( 243/2580) spt::bin/spt cli::tests::monic_verbs_parse
2026-08-18T01:42:28.0274222Z         PASS [   0.135s] ( 244/2580) spt::bin/spt cli::tests::no_redeem_surface_claims_a_reverse_the_minting_side_could_not_open
2026-08-18T01:42:28.0343939Z         PASS [   0.138s] ( 245/2580) spt::bin/spt cli::tests::node_group_discards_self_and_skips_empty
2026-08-18T01:42:28.0344623Z         PASS [   0.124s] ( 246/2580) spt::bin/spt cli::tests::node_group_freshest_epoch_wins_and_unions_subnets
2026-08-18T01:42:28.0449981Z         PASS [   0.131s] ( 247/2580) spt::bin/spt cli::tests::node_group_same_id_two_nodes_two_groups
2026-08-18T01:42:28.0519090Z         PASS [   0.095s] ( 248/2580) spt::bin/spt cli::tests::node_grouped_render_structure_and_palette
2026-08-18T01:42:28.0584745Z         PASS [   0.090s] ( 249/2580) spt::bin/spt cli::tests::node_level_label_names_an_endpointless_peer
2026-08-18T01:42:28.0622485Z         PASS [   0.083s] ( 250/2580) spt::bin/spt cli::tests::node_rows_disambiguate_only_on_label_collision
2026-08-18T01:42:28.0713461Z         PASS [   0.089s] ( 251/2580) spt::bin/spt cli::tests::node_status_rows_denominator_counts_routable_only
2026-08-18T01:42:28.0748464Z         PASS [   0.092s] ( 252/2580) spt::bin/spt cli::tests::node_status_rows_settle_cheap_signals_probe_only_stale
2026-08-18T01:42:28.0784777Z         PASS [   0.093s] ( 253/2580) spt::bin/spt cli::tests::not_elevated_refuses_without_leaking_code_or_saving
2026-08-18T01:42:28.0847828Z         PASS [   0.084s] ( 254/2580) spt::bin/spt cli::tests::notify_subnet_resolution_home_default
2026-08-18T01:42:28.0978459Z         PASS [   0.064s] ( 255/2580) spt::bin/spt cli::tests::only_a_bake_that_can_admit_the_whole_node_demands_the_acknowledgment
2026-08-18T01:42:28.1021505Z         PASS [   0.077s] ( 256/2580) spt::bin/spt cli::tests::notify_surface_parses
2026-08-18T01:42:28.1036738Z         PASS [   0.069s] ( 257/2580) spt::bin/spt cli::tests::only_rows_with_a_node_are_asked_and_answers_land_on_their_own_row
2026-08-18T01:42:28.1092690Z         PASS [   0.066s] ( 258/2580) spt::bin/spt cli::tests::only_the_send_side_defaults_to_msg
2026-08-18T01:42:28.1147327Z         PASS [   0.063s] ( 259/2580) spt::bin/spt cli::tests::origin_asset_urls_latest_and_tag
2026-08-18T01:42:28.1222353Z         PASS [   0.063s] ( 260/2580) spt::bin/spt cli::tests::own_nested_section_renders_under_this_node_without_moving_the_total
2026-08-18T01:42:28.1363528Z         PASS [   0.065s] ( 261/2580) spt::bin/spt cli::tests::pair_namespace_is_gone
2026-08-18T01:42:28.1364265Z         PASS [   0.062s] ( 262/2580) spt::bin/spt cli::tests::peer_health_line_names_absent_peers_as_their_own_state
2026-08-18T01:42:28.1995429Z         PASS [   0.118s] ( 263/2580) spt::bin/spt cli::tests::peer_health_line_names_the_stage_and_stays_silent_when_idle
2026-08-18T01:42:28.2517165Z         PASS [   0.143s] ( 264/2580) spt::bin/spt cli::tests::post_step_notice_arbitration
2026-08-18T01:42:28.2531608Z         PASS [   0.167s] ( 265/2580) spt::bin/spt cli::tests::poll_until_ready_fastpath_timeout_and_later_success
2026-08-18T01:42:28.2567325Z         PASS [   0.907s] ( 266/2580) spt::bin/spt api::startup::tests::api_listen_admits_the_reserved_id_only_as_a_bring_ups_completion
2026-08-18T01:42:28.2685809Z         PASS [   0.153s] ( 267/2580) spt::bin/spt cli::tests::project_index_line_states_health_not_presence
2026-08-18T01:42:28.2766048Z         PASS [   0.152s] ( 268/2580) spt::bin/spt cli::tests::prune_candidates_resolve_never_guess
2026-08-18T01:42:28.2766986Z         PASS [   0.139s] ( 269/2580) spt::bin/spt cli::tests::psyche_companion_is_named_without_a_status
2026-08-18T01:42:28.2767668Z         PASS [   0.175s] ( 270/2580) spt::bin/spt cli::tests::probe_all_cap_batches_into_windows
2026-08-18T01:42:28.3013696Z         PASS [   0.026s] ( 271/2580) spt::bin/spt cli::tests::remote_cell_project_ref_from_gossiped_recent_projects
2026-08-18T01:42:28.3516430Z         PASS [   0.093s] ( 272/2580) spt::bin/spt cli::tests::purge_offline_gate_and_self_guard
2026-08-18T01:42:28.3734510Z         PASS [   0.097s] ( 273/2580) spt::bin/spt cli::tests::requesting_verbs_force_an_explicit_directionality
2026-08-18T01:42:29.2509546Z         PASS [   1.145s] ( 274/2580) spt::bin/spt cli::tests::probe_all_runs_concurrently_in_input_order
2026-08-18T01:42:29.2525587Z         PASS [   1.112s] ( 275/2580) spt::bin/spt cli::tests::public_help_carries_no_internal_codes_at_any_ruled_site
2026-08-18T01:42:29.2553744Z         PASS [   1.140s] ( 276/2580) spt::bin/spt cli::tests::probe_all_timeout_settles_false_without_stalling_batch
2026-08-18T01:42:29.3118995Z         PASS [   0.987s] ( 277/2580) spt::bin/spt cli::tests::registered_github_home_detects_active_collision
2026-08-18T01:42:29.3429369Z         PASS [   1.002s] ( 278/2580) spt::bin/spt cli::tests::resolve_transport_auto_follows_probe
2026-08-18T01:42:29.3510872Z         PASS [   0.103s] ( 279/2580) spt::bin/spt cli::tests::rest_filter_status_first_ordering
2026-08-18T01:42:29.3627714Z         PASS [   0.983s] ( 280/2580) spt::bin/spt cli::tests::resolve_transport_explicit_never_probes
2026-08-18T01:42:29.3653672Z         PASS [   0.117s] ( 281/2580) spt::bin/spt cli::tests::rest_filter_hides_suspended_shows_all_and_corrupt_always
2026-08-18T01:42:29.3674601Z         PASS [   1.066s] ( 282/2580) spt::bin/spt cli::tests::resolve_proof_target_override_reads_on_disk
2026-08-18T01:42:29.3697481Z         PASS [   1.113s] ( 283/2580) spt::bin/spt api::startup::tests::bind_assigns_home_and_revive_preserves_it
2026-08-18T01:42:29.3699530Z         PASS [   0.120s] ( 284/2580) spt::bin/spt cli::tests::rest_filter_total_disclosure_and_corrupt_annotation
2026-08-18T01:42:29.3706499Z         PASS [   0.116s] ( 285/2580) spt::bin/spt cli::tests::restart_plans_lethal_leg_last
2026-08-18T01:42:29.4005033Z         PASS [   0.062s] ( 286/2580) spt::bin/spt cli::tests::ring_no_reply_arms_report_the_wait_in_the_callers_unit
2026-08-18T01:42:29.4153444Z         PASS [   0.058s] ( 287/2580) spt::bin/spt cli::tests::ring_timeout_parses_bare_as_minutes_and_honors_suffixes
2026-08-18T01:42:29.4195173Z         PASS [   0.069s] ( 288/2580) spt::bin/spt cli::tests::ring_timeout_defaults
2026-08-18T01:42:29.4527479Z         PASS [   1.179s] ( 289/2580) spt::bin/spt cli::tests::release_archive_extracts_to_a_registrable_root
2026-08-18T01:42:29.4825786Z         PASS [   0.114s] ( 290/2580) spt::bin/spt cli::tests::self_endpoint_line_reports_the_live_relay_or_says_there_is_none
2026-08-18T01:42:29.4892253Z         PASS [   0.124s] ( 291/2580) spt::bin/spt cli::tests::run_bounded_yields_value_or_timeout_default
2026-08-18T01:42:29.4959616Z         PASS [   0.126s] ( 292/2580) spt::bin/spt cli::tests::self_pin_annotates_host_error
2026-08-18T01:42:29.5034225Z         PASS [   0.132s] ( 293/2580) spt::bin/spt cli::tests::self_pin_annotates_psyche_host_failure
2026-08-18T01:42:29.5166594Z         PASS [   0.100s] ( 294/2580) spt::bin/spt cli::tests::self_pin_includes_description_when_present
2026-08-18T01:42:29.5184782Z         PASS [   0.120s] ( 295/2580) spt::bin/spt cli::tests::self_pin_annotates_translation_fault
2026-08-18T01:42:29.5248997Z         PASS [   0.105s] ( 296/2580) spt::bin/spt cli::tests::send_reply_to_flag_is_removed_and_target_required
2026-08-18T01:42:29.5928220Z         PASS [   0.221s] ( 297/2580) spt::bin/spt api::startup::tests::bind_gateway_earns_no_online_stamp
2026-08-18T01:42:29.6212670Z         PASS [   0.168s] ( 298/2580) spt::bin/spt cli::tests::send_user_msg_flag_parses
2026-08-18T01:42:29.9366452Z         PASS [   0.421s] ( 299/2580) spt::bin/spt cli::tests::shell_owner_exclusivity_negatives
2026-08-18T01:42:29.9509339Z         PASS [   0.425s] ( 300/2580) spt::bin/spt cli::tests::shell_spawn_profiled_option_resolves_and_shares_cap
2026-08-18T01:42:29.9730490Z         PASS [   0.347s] ( 301/2580) spt::bin/spt cli::tests::shell_subcommands_parse
2026-08-18T01:42:29.9731074Z         PASS [   0.475s] ( 302/2580) spt::bin/spt cli::tests::shell_relink_relaunches_offline_instances_only
2026-08-18T01:42:29.9959369Z         PASS [   0.081s] ( 303/2580) spt::bin/spt cli::tests::show_code_prints_reprovisioning_material
2026-08-18T01:42:30.1632697Z         PASS [   0.648s] ( 304/2580) spt::bin/spt cli::tests::shell_spawn_approval_floor_gates
2026-08-18T01:42:30.2639805Z         PASS [   0.779s] ( 305/2580) spt::bin/spt cli::tests::shell_channels_relay_sensory_and_text_file
2026-08-18T01:42:30.2680365Z         PASS [   0.270s] ( 306/2580) spt::bin/spt cli::tests::single_subnet_auto_selects_and_code_matches_seed
2026-08-18T01:42:30.2703039Z         PASS [   0.748s] ( 307/2580) spt::bin/spt cli::tests::shell_spawn_cap_and_over_cap_gates
2026-08-18T01:42:30.2837878Z         PASS [   0.310s] ( 308/2580) spt::bin/spt cli::tests::shutdown_on_a_harness_hosted_endpoint_claims_no_process
2026-08-18T01:42:30.3062686Z         PASS [   0.356s] ( 309/2580) spt::bin/spt cli::tests::shutdown_and_stop_share_the_postcondition_and_differ_only_in_ceremony
2026-08-18T01:42:30.3403182Z         PASS [   0.369s] ( 310/2580) spt::bin/spt cli::tests::shutdown_on_a_broker_hosted_endpoint_stamps_after_the_reap
2026-08-18T01:42:30.3850768Z         PASS [   0.101s] ( 311/2580) spt::bin/spt cli::tests::stall_evict_line_surfaces_only_a_real_tally
2026-08-18T01:42:30.3851489Z         PASS [   0.079s] ( 312/2580) spt::bin/spt cli::tests::stop_guard_refuses_live_sessions_without_force
2026-08-18T01:42:30.4029470Z         PASS [   0.065s] ( 313/2580) spt::bin/spt cli::tests::subcommands_parse
2026-08-18T01:42:30.4075326Z         PASS [   0.147s] ( 314/2580) spt::bin/spt cli::tests::stage_then_swap_failed_fetch_preserves_install
2026-08-18T01:42:30.4584838Z         PASS [   0.073s] ( 315/2580) spt::bin/spt cli::tests::subnet_mode_lines_state_declared_captured_and_pending
2026-08-18T01:42:30.4708660Z         PASS [   0.066s] ( 316/2580) spt::bin/spt cli::tests::subnet_status_renders_rows_and_hints_never_secrets
2026-08-18T01:42:30.4716949Z         PASS [   0.064s] ( 317/2580) spt::bin/spt cli::tests::subnets_joined_banner_renders_rows_and_divider
2026-08-18T01:42:30.4768639Z         PASS [   0.018s] ( 318/2580) spt::bin/spt cli::tests::subprocess_detail_prefers_stderr_then_stdout
2026-08-18T01:42:30.6118379Z         PASS [   0.139s] ( 319/2580) spt::bin/spt cli::tests::the_bare_form_refuses_rather_than_guessing
2026-08-18T01:42:30.6121547Z         PASS [   0.230s] ( 320/2580) spt::bin/spt cli::tests::subnet_arg_shapes_parse
2026-08-18T01:42:30.6150233Z         PASS [   0.144s] ( 321/2580) spt::bin/spt cli::tests::the_bare_form_is_the_send_form
2026-08-18T01:42:30.6187360Z         PASS [   2.421s] ( 322/2580) spt::bin/spt cli::tests::purge_force_asks_before_it_tears_anything_down
2026-08-18T01:42:30.6224898Z         PASS [   0.146s] ( 323/2580) spt::bin/spt cli::tests::the_bare_node_verb_defaults_to_the_status_view_under_both_spellings
2026-08-18T01:42:30.6415507Z         PASS [   0.380s] ( 324/2580) spt::bin/spt cli::tests::staged_floor_admits_when_core_meets_floor
2026-08-18T01:42:30.6868783Z         PASS [   0.423s] ( 325/2580) spt::bin/spt cli::tests::staged_floor_refuses_above_floor_and_leaves_dest_untouched
2026-08-18T01:42:30.7198640Z         PASS [   0.108s] ( 326/2580) spt::bin/spt cli::tests::the_bare_status_view_states_the_mode_facts_for_every_row
2026-08-18T01:42:30.7321822Z         PASS [   0.118s] ( 327/2580) spt::bin/spt cli::tests::the_conjunction_notice_fires_per_missing_half_and_stays_silent_when_both_hold
2026-08-18T01:42:30.7336450Z         PASS [   0.582s] ( 328/2580) spt::bin/spt cli::tests::spt_hosted_no_relay_detection
2026-08-18T01:42:30.7392160Z         PASS [   0.121s] ( 329/2580) spt::bin/spt cli::tests::the_conjunction_notice_names_the_whitelist_its_seat_and_the_posture
2026-08-18T01:42:30.7546865Z         PASS [   1.161s] ( 330/2580) spt::bin/spt api::startup::tests::bind_listen_control_detach_keeps_the_earned_hosting_authority
2026-08-18T01:42:30.7583485Z         PASS [   0.072s] ( 331/2580) spt::bin/spt cli::tests::the_denial_names_the_blast_radius_and_a_cure_that_fits_its_ground
2026-08-18T01:42:30.7637034Z         PASS [   0.138s] ( 332/2580) spt::bin/spt cli::tests::the_create_ceremony_names_the_heal_for_an_older_minter
2026-08-18T01:42:30.7641822Z         PASS [   0.152s] ( 333/2580) spt::bin/spt cli::tests::the_briefing_prescribes_only_verbs_the_grammar_has
2026-08-18T01:42:30.7707916Z         PASS [   0.125s] ( 334/2580) spt::bin/spt cli::tests::the_cross_node_mutual_refusal_is_gone_from_every_surface_that_carried_it
2026-08-18T01:42:30.7734756Z         PASS [   0.041s] ( 335/2580) spt::bin/spt cli::tests::the_engine_room_briefing_speaks_the_cli_vocabulary
2026-08-18T01:42:30.7896142Z         PASS [   0.071s] ( 336/2580) spt::bin/spt cli::tests::the_deprecation_note_renders_on_both_spellings_of_the_node_verb
2026-08-18T01:42:30.8022944Z         PASS [   0.063s] ( 337/2580) spt::bin/spt cli::tests::the_flagless_access_listing_is_wired_distinctly_from_its_subcommands
2026-08-18T01:42:30.8609901Z         PASS [   0.100s] ( 338/2580) spt::bin/spt cli::tests::the_gc_render_says_what_it_refused_and_what_it_would_delete
2026-08-18T01:42:30.8612528Z         PASS [   0.102s] ( 339/2580) spt::bin/spt cli::tests::the_fork_pair_consequence_follows_the_chain_verdict_not_the_rule_rows
2026-08-18T01:42:30.8638673Z         PASS [   0.100s] ( 340/2580) spt::bin/spt cli::tests::the_human_and_json_legs_agree_on_every_unlisted_row
2026-08-18T01:42:30.8667663Z         PASS [   0.134s] ( 341/2580) spt::bin/spt cli::tests::the_evidence_census_reads_each_local_source
2026-08-18T01:42:30.8764330Z         PASS [   0.109s] ( 342/2580) spt::bin/spt cli::tests::the_knock_prescription_names_the_fork_pair_only_where_it_is_needed
2026-08-18T01:42:30.8781263Z         PASS [   0.105s] ( 343/2580) spt::bin/spt cli::tests::the_legacy_allow_echo_says_discover_is_untouched_and_scopes_both_levers
2026-08-18T01:42:30.9143693Z         PASS [   0.112s] ( 344/2580) spt::bin/spt cli::tests::the_mint_probe_answers_only_for_a_fresh_mint
2026-08-18T01:42:30.9194718Z         PASS [   0.059s] ( 345/2580) spt::bin/spt cli::tests::the_presenters_three_renderings_stay_three_things
2026-08-18T01:42:30.9206271Z         PASS [   0.057s] ( 346/2580) spt::bin/spt cli::tests::the_remote_knock_refusals_render_as_prose
2026-08-18T01:42:30.9253521Z         PASS [   0.059s] ( 347/2580) spt::bin/spt cli::tests::the_rendered_peer_fraction_counts_one_population_across_a_subnet_leave
2026-08-18T01:42:30.9375482Z         PASS [   0.061s] ( 348/2580) spt::bin/spt cli::tests::the_rendered_section_is_the_composers_output
2026-08-18T01:42:30.9599704Z         PASS [   3.920s] ( 349/2580) spt::bin/spt cli::tests::endpoint_role_overwrite_is_the_sole_writer
2026-08-18T01:42:31.0315017Z         PASS [   0.277s] ( 350/2580) spt::bin/spt api::startup::tests::bind_live_agent_over_prior_ready_agent_earns_online_on_controllable_with_preserved_type
2026-08-18T01:42:31.0644749Z         PASS [   0.144s] ( 351/2580) spt::bin/spt cli::tests::the_three_landings_render_distinct_lines
2026-08-18T01:42:31.0762342Z         PASS [   0.151s] ( 352/2580) spt::bin/spt cli::tests::the_tuple_flags_build_the_rule_they_name
2026-08-18T01:42:31.0775475Z         PASS [   0.288s] ( 353/2580) spt::bin/spt cli::tests::the_local_and_wire_arms_write_one_identical_grant
2026-08-18T01:42:31.0830639Z         PASS [   0.161s] ( 354/2580) spt::bin/spt cli::tests::the_three_send_outcomes_owe_three_different_receipts
2026-08-18T01:42:31.0851183Z         PASS [   0.125s] ( 355/2580) spt::bin/spt cli::tests::the_unlisted_listing_drops_an_excluded_peer_and_keeps_the_rest
2026-08-18T01:42:31.0896497Z         PASS [   0.152s] ( 356/2580) spt::bin/spt cli::tests::the_unlisted_footer_explainer_lines_are_not_rendered
2026-08-18T01:42:31.1102659Z         PASS [   0.033s] ( 357/2580) spt::bin/spt cli::tests::the_visible_alias_reaches_the_root_listing
2026-08-18T01:42:31.1112459Z         PASS [   0.048s] ( 358/2580) spt::bin/spt cli::tests::the_unspooled_remedy_prescribes_a_verb_the_grammar_has
2026-08-18T01:42:31.1114707Z         PASS [   0.030s] ( 359/2580) spt::bin/spt cli::tests::this_node_group_merges_roster_with_unbound_truth
2026-08-18T01:42:31.1192057Z         PASS [   0.241s] ( 360/2580) spt::bin/spt cli::tests::the_seat_and_the_acknowledgment_are_the_mints_and_both_arms_refuse_alike
2026-08-18T01:42:31.1348993Z         PASS [   0.057s] ( 361/2580) spt::bin/spt cli::tests::the_widening_remedy_is_sited_with_its_flag_not_in_the_shared_section
2026-08-18T01:42:31.1621089Z         PASS [   0.076s] ( 362/2580) spt::bin/spt cli::tests::trust_mutation_gate_refuses_without_confirmed_elevation
2026-08-18T01:42:31.1759843Z         PASS [   0.067s] ( 363/2580) spt::bin/spt cli::tests::unknown_elevation_falls_back
2026-08-18T01:42:31.1825203Z         PASS [   0.091s] ( 364/2580) spt::bin/spt cli::tests::trust_warning_verbs_parse
2026-08-18T01:42:31.1826108Z         PASS [   0.071s] ( 365/2580) spt::bin/spt cli::tests::unknown_named_subnet_is_usage_error
2026-08-18T01:42:31.1972833Z         PASS [   0.085s] ( 366/2580) spt::bin/spt cli::tests::update_adapters_verb_parses_with_optional_names
2026-08-18T01:42:31.1975218Z         PASS [   0.078s] ( 367/2580) spt::bin/spt cli::tests::update_fetch_apply_flag_parses
2026-08-18T01:42:31.2011401Z         PASS [   0.066s] ( 368/2580) spt::bin/spt cli::tests::what_the_listing_prescribes_is_what_the_approve_path_honors
2026-08-18T01:42:31.2122068Z         PASS [   0.051s] ( 369/2580) spt::bin/spt cli::tests::whoami_parses_as_the_identity_verb
2026-08-18T01:42:31.2263779Z         PASS [   0.044s] ( 370/2580) spt::bin/spt elevation::tests::already_elevated_short_circuits_on_every_os
2026-08-18T01:42:31.2329359Z         PASS [   0.057s] ( 371/2580) spt::bin/spt cli::verb_surface_route_table::every_bringup_door_routes_where_it_says
2026-08-18T01:42:31.2333106Z         PASS [   0.319s] ( 372/2580) spt::bin/spt cli::tests::the_surface_section_rides_the_ruled_sites_and_no_others
2026-08-18T01:42:31.2401872Z         PASS [   0.211s] ( 373/2580) spt::bin/spt api::startup::tests::bind_records_cwd_so_picker_can_group_by_project
2026-08-18T01:42:31.2488342Z         PASS [   0.068s] ( 374/2580) spt::bin/spt cli::verb_surface_route_table::the_exclusions_are_real_refusals
2026-08-18T01:42:31.2792971Z         PASS [   0.083s] ( 375/2580) spt::bin/spt elevation::tests::current_returns_a_determinate_level_on_supported_platforms
2026-08-18T01:42:31.2842399Z         PASS [   0.087s] ( 376/2580) spt::bin/spt elevation::tests::fallback_message_names_authenticator_app_and_subnet
2026-08-18T01:42:31.2911113Z         PASS [   0.090s] ( 377/2580) spt::bin/spt elevation::tests::gate_shows_only_when_confirmed_elevated
2026-08-18T01:42:31.2978950Z         PASS [   0.086s] ( 378/2580) spt::bin/spt elevation::tests::launcher_argv_is_absolute_exe_plus_verbatim_args
2026-08-18T01:42:31.3097519Z         PASS [   0.082s] ( 379/2580) spt::bin/spt elevation::tests::launchers_never_shell_interpolate_a_crafted_arg
2026-08-18T01:42:31.3188760Z         PASS [   0.085s] ( 380/2580) spt::bin/spt elevation::tests::print_hint_floor_uses_absolute_path_each_os
2026-08-18T01:42:31.3426706Z         PASS [   0.109s] ( 381/2580) spt::bin/spt elevation::tests::unix_path_order_tty_then_pkexec_then_terminal_then_hint
2026-08-18T01:42:31.3497974Z         PASS [   0.098s] ( 382/2580) spt::bin/spt elevation::tests::windows_uac_only_interactive_other_always_prints
2026-08-18T01:42:31.3558049Z         PASS [   0.065s] ( 383/2580) spt::bin/spt helpfmt::tests::code_styles_with_color_and_strips_without
2026-08-18T01:42:31.3558978Z         PASS [   0.077s] ( 384/2580) spt::bin/spt helpfmt::tests::atx_header_at_line_start_strips_and_bolds
2026-08-18T01:42:31.3565745Z         PASS [   0.072s] ( 385/2580) spt::bin/spt helpfmt::tests::bold_styles_with_color_and_strips_without
2026-08-18T01:42:31.3624765Z         PASS [   0.122s] ( 386/2580) spt::bin/spt api::startup::tests::bind_refuses_a_session_id_that_squats_a_psyche_custody_sid
2026-08-18T01:42:31.4016486Z         PASS [   0.104s] ( 387/2580) spt::bin/spt helpfmt::tests::color_enabled_truth_table
2026-08-18T01:42:31.4064432Z         PASS [   0.098s] ( 388/2580) spt::bin/spt helpfmt::tests::dual_contract_token_survives_strip_mode
2026-08-18T01:42:31.4122677Z         PASS [   0.094s] ( 389/2580) spt::bin/spt helpfmt::tests::dual_contract_token_unstyled_while_prose_styles_on_color
2026-08-18T01:42:31.4168664Z         PASS [   0.075s] ( 390/2580) spt::bin/spt helpfmt::tests::empty_and_unmatched_markers_stay_literal
2026-08-18T01:42:31.4222323Z         PASS [   0.076s] ( 391/2580) spt::bin/spt helpfmt::tests::link_becomes_its_text
2026-08-18T01:42:31.4302760Z         PASS [   0.074s] ( 392/2580) spt::bin/spt helpfmt::tests::marker_never_spans_a_hard_break
2026-08-18T01:42:31.4352406Z         PASS [   0.079s] ( 393/2580) spt::bin/spt helpfmt::tests::marker_spans_a_clap_soft_wrap
2026-08-18T01:42:31.4405942Z         PASS [   0.084s] ( 394/2580) spt::bin/spt helpfmt::tests::multibyte_text_survives
2026-08-18T01:42:31.4517849Z         PASS [   0.050s] ( 395/2580) spt::bin/spt helpfmt::tests::nested_code_inside_bold_styles_both
2026-08-18T01:42:31.4584565Z         PASS [   0.052s] ( 396/2580) spt::bin/spt helpfmt::tests::plain_text_is_unchanged
2026-08-18T01:42:31.4675007Z         PASS [   0.054s] ( 397/2580) spt::bin/spt helpfmt::tests::preexisting_ansi_is_passed_through_untouched
2026-08-18T01:42:31.4731581Z         PASS [   0.056s] ( 398/2580) spt::bin/spt helpfmt::tests::resolve_console_color_strips_when_vt_unavailable
2026-08-18T01:42:31.4766898Z         PASS [   0.055s] ( 399/2580) spt::bin/spt monicverb::tests::add_refuses_to_replace_and_update_refuses_to_invent
2026-08-18T01:42:31.4810474Z         PASS [   0.051s] ( 400/2580) spt::bin/spt monicverb::tests::no_monic_verb_is_elevation_gated
2026-08-18T01:42:31.4857340Z         PASS [   0.051s] ( 401/2580) spt::bin/spt picker::data::tests::disambiguate_project_ids_cases
2026-08-18T01:42:31.4906148Z         PASS [   0.050s] ( 402/2580) spt::bin/spt picker::data::tests::driven_by_display_renders_name_not_hex
2026-08-18T01:42:31.5656650Z         PASS [   0.091s] ( 403/2580) spt::bin/spt picker::data::tests::indexed_projection_full_w2shaped_and_absent_legs
2026-08-18T01:42:31.5701868Z         PASS [   0.093s] ( 404/2580) spt::bin/spt picker::data::tests::non_drivable_predicate_covers_worker_and_psyche
2026-08-18T01:42:31.5927343Z         PASS [   0.102s] ( 405/2580) spt::bin/spt picker::data::tests::project_refs_from_sessions_excludes_owlery_and_dedups_newest_first
2026-08-18T01:42:31.6359166Z         PASS [   0.059s] ( 406/2580) spt::bin/spt picker::data::tests::project_refs_from_unions_fresh_origin_and_store_branches
2026-08-18T01:42:31.6392735Z         PASS [   0.151s] ( 407/2580) spt::bin/spt picker::data::tests::own_node_tab_label_falls_back_to_keyprefix
2026-08-18T01:42:31.6559643Z         PASS [   0.085s] ( 408/2580) spt::bin/spt picker::data::tests::reconcile_overrides_subnet_with_local_roster
2026-08-18T01:42:31.6683148Z         PASS [   0.298s] ( 409/2580) spt::bin/spt api::startup::tests::bind_with_type_establishes_a_gateway_endpoint
2026-08-18T01:42:31.6788602Z         PASS [   0.218s] ( 410/2580) spt::bin/spt picker::data::tests::gather_endpoints_projects_from_seeded_index_with_zero_git
2026-08-18T01:42:31.6789503Z         PASS [   0.214s] ( 411/2580) spt::bin/spt picker::data::tests::gather_renders_live_unbound
2026-08-18T01:42:31.7080205Z         PASS [   0.075s] ( 412/2580) spt::bin/spt picker::data::tests::resume_rows_derive_per_row_project_and_drop_owlery_sessions
2026-08-18T01:42:31.7094472Z         PASS [   0.117s] ( 413/2580) spt::bin/spt picker::data::tests::remote_picker_renders_suspended_dead_perch_offline
2026-08-18T01:42:31.7099868Z         PASS [   0.086s] ( 414/2580) spt::bin/spt picker::data::tests::remote_rows_render_full_palette_parity
2026-08-18T01:42:31.7102466Z         PASS [   5.449s] ( 415/2580) spt::bin/spt cli::tests::adapter_translate_proof_gates_on_commit
2026-08-18T01:42:31.7157735Z         PASS [   0.230s] ( 416/2580) spt::bin/spt picker::data::tests::picker_excludes_flat_worker_and_psyche
2026-08-18T01:42:31.7169178Z         PASS [   0.061s] ( 417/2580) spt::bin/spt picker::data::tests::resume_rows_title_from_index_cwd_map_with_pure_fallback
2026-08-18T01:42:31.7503005Z         PASS [   0.088s] ( 418/2580) spt::bin/spt api::startup::tests::bind_with_unrelated_sid_is_unaffected_by_the_squat_guard
2026-08-18T01:42:31.7521980Z         PASS [   0.082s] ( 419/2580) spt::bin/spt picker::data::tests::row_status_drives_unbound_display
2026-08-18T01:42:31.7638249Z         PASS [   0.054s] ( 420/2580) spt::bin/spt picker::model::tests::adapter_tree_nests_profiles
2026-08-18T01:42:31.7676381Z         PASS [   0.057s] ( 421/2580) spt::bin/spt picker::model::tests::back_unwinds
2026-08-18T01:42:31.7765855Z         PASS [   0.066s] ( 422/2580) spt::bin/spt picker::model::tests::build_project_choices_head_here_rest
2026-08-18T01:42:31.7770811Z         PASS [   0.067s] ( 423/2580) spt::bin/spt picker::model::tests::category_labels_render_display_forms
2026-08-18T01:42:31.7835267Z         PASS [   0.108s] ( 424/2580) spt::bin/spt picker::data::tests::shared_machine_is_one_group_with_unioned_subnets
2026-08-18T01:42:31.7905942Z         PASS [   0.075s] ( 425/2580) spt::bin/spt picker::model::tests::category_ring_wraps
2026-08-18T01:42:31.7971094Z         PASS [   0.080s] ( 426/2580) spt::bin/spt picker::model::tests::change_adapter_picks_and_returns_to_confirm
2026-08-18T01:42:31.8049417Z         PASS [   0.053s] ( 427/2580) spt::bin/spt picker::model::tests::choose_project_outcome_bakes_cwd_and_diverts
2026-08-18T01:42:31.8085469Z         PASS [   0.060s] ( 428/2580) spt::bin/spt api::startup::tests::empty_session_seed_refusal_spends_the_seed_no_restore
2026-08-18T01:42:31.8111873Z         PASS [   0.049s] ( 429/2580) spt::bin/spt picker::model::tests::confirm_local_offline_unchanged_by_wake_split
2026-08-18T01:42:31.8857629Z         PASS [   0.108s] ( 430/2580) spt::bin/spt picker::model::tests::confirm_options_status_dependent
2026-08-18T01:42:31.8909217Z         PASS [   0.120s] ( 431/2580) spt::bin/spt picker::model::tests::confirm_options_remote_suspended_is_wake_not_start
2026-08-18T01:42:31.8912319Z         PASS [   0.114s] ( 432/2580) spt::bin/spt picker::model::tests::confirm_terminal_routes
2026-08-18T01:42:31.8951368Z         PASS [   0.114s] ( 433/2580) spt::bin/spt picker::model::tests::confirm_terminal_wake_carries_raw_node
2026-08-18T01:42:31.9061075Z         PASS [   0.115s] ( 434/2580) spt::bin/spt picker::model::tests::create_new_multisubnet_inserts_home_layer
2026-08-18T01:42:31.9209131Z         PASS [   0.123s] ( 435/2580) spt::bin/spt picker::model::tests::create_outcome_bakes_run
2026-08-18T01:42:31.9242489Z         PASS [   0.119s] ( 436/2580) spt::bin/spt picker::model::tests::cursor_clamps
2026-08-18T01:42:31.9373901Z         PASS [   0.129s] ( 437/2580) spt::bin/spt api::startup::tests::empty_session_seed_refused
2026-08-18T01:42:31.9913548Z         PASS [   0.180s] ( 438/2580) spt::bin/spt picker::model::tests::display_mapping_matrix
2026-08-18T01:42:32.0177768Z         PASS [   0.133s] ( 439/2580) spt::bin/spt picker::model::tests::display_status_four_state_type_gated
2026-08-18T01:42:32.0267258Z         PASS [   0.131s] ( 440/2580) spt::bin/spt picker::model::tests::ep_display_glyph_and_square_palette
2026-08-18T01:42:32.0271446Z         PASS [   0.139s] ( 441/2580) spt::bin/spt picker::model::tests::display_status_unbound_is_hollow_and_attachable
2026-08-18T01:42:32.0272733Z         PASS [   0.136s] ( 442/2580) spt::bin/spt picker::model::tests::empty_scope_opens_create
2026-08-18T01:42:32.0275085Z         PASS [   0.108s] ( 443/2580) spt::bin/spt picker::model::tests::filter_narrows
2026-08-18T01:42:32.0280963Z         PASS [   0.122s] ( 444/2580) spt::bin/spt picker::model::tests::esc_backs_out_of_home_layer
2026-08-18T01:42:32.0289044Z         PASS [   0.105s] ( 445/2580) spt::bin/spt picker::model::tests::from_resource_row_maps_gossiped_adapter_projects_controlled
2026-08-18T01:42:32.0439702Z         PASS [   0.577s] ( 446/2580) spt::bin/spt picker::data::tests::home_subnet_options_is_mru_ordered
2026-08-18T01:42:32.0969495Z         PASS [   0.106s] ( 447/2580) spt::bin/spt picker::model::tests::home_selection_bakes_into_run_subnet
2026-08-18T01:42:32.1015148Z         PASS [   0.084s] ( 448/2580) spt::bin/spt picker::model::tests::kind_routes
2026-08-18T01:42:32.1109099Z         PASS [   0.084s] ( 449/2580) spt::bin/spt picker::model::tests::launch_keys_live_only_on_launch_capable_highlights
2026-08-18T01:42:32.1151688Z         PASS [   0.088s] ( 450/2580) spt::bin/spt picker::model::tests::prefill_jumps_to_create
2026-08-18T01:42:32.1250620Z         PASS [   0.098s] ( 451/2580) spt::bin/spt picker::model::tests::project_filter_keys_on_slug_while_tab_renders_display
2026-08-18T01:42:32.1371183Z         PASS [   0.109s] ( 452/2580) spt::bin/spt picker::model::tests::purge_confirm_yields_outcome_and_backs_out
2026-08-18T01:42:32.1398165Z         PASS [   0.111s] ( 453/2580) spt::bin/spt picker::model::tests::reenter_create_keeps_or_clears_id
2026-08-18T01:42:32.1413872Z         PASS [   0.113s] ( 454/2580) spt::bin/spt picker::model::tests::purge_shortcut_gates_to_offline_local
2026-08-18T01:42:32.1469945Z         PASS [   0.103s] ( 455/2580) spt::bin/spt picker::model::tests::remove_endpoint_drops_row_and_clamps_cursor
2026-08-18T01:42:32.1508015Z         PASS [   0.054s] ( 456/2580) spt::bin/spt picker::model::tests::resume_outcome_adapter_follows_recorded_row
2026-08-18T01:42:32.2285303Z         PASS [   0.115s] ( 457/2580) spt::bin/spt picker::model::tests::resume_title_render
2026-08-18T01:42:32.2285980Z         PASS [   0.125s] ( 458/2580) spt::bin/spt picker::model::tests::resume_outcome_bakes_session
2026-08-18T01:42:32.2389426Z         PASS [   0.123s] ( 459/2580) spt::bin/spt picker::model::tests::should_offer_project_choice_fire_conditions
2026-08-18T01:42:32.2419544Z         PASS [   0.105s] ( 460/2580) spt::bin/spt picker::model::tests::suspended_is_distinct_from_offline
2026-08-18T01:42:32.2462413Z         PASS [   0.120s] ( 461/2580) spt::bin/spt picker::model::tests::single_subnet_skips_home_layer
2026-08-18T01:42:32.2525702Z         PASS [   0.112s] ( 462/2580) spt::bin/spt picker::model::tests::the_picker_refuses_the_reserved_id_as_it_is_typed
2026-08-18T01:42:32.2583232Z         PASS [   0.116s] ( 463/2580) spt::bin/spt picker::model::tests::visible_partitions_and_sorts
2026-08-18T01:42:32.2659171Z         PASS [   0.327s] ( 464/2580) spt::bin/spt api::startup::tests::establish_stamps_controllable_by_hosting_mode
2026-08-18T01:42:32.2691729Z         PASS [   0.122s] ( 465/2580) spt::bin/spt picker::shortcut::tests::basename_is_parameterized
2026-08-18T01:42:32.2741699Z         PASS [   0.123s] ( 466/2580) spt::bin/spt picker::shortcut::tests::sentinel_detection_spans_both_generations
2026-08-18T01:42:32.2779303Z         PASS [   0.053s] ( 467/2580) spt::bin/spt picker::shortcut::tests::the_body_is_the_ladder_verb
2026-08-18T01:42:32.3069232Z         PASS [   0.081s] ( 468/2580) spt::bin/spt picker::shortcut::tests::write_create_update_regenerate_refuse
2026-08-18T01:42:32.3583122Z         PASS [   0.119s] ( 469/2580) spt::bin/spt picker::tests::backspace_backs_out_screens_like_esc
2026-08-18T01:42:32.3625651Z         PASS [   0.120s] ( 470/2580) spt::bin/spt picker::tests::backspace_stays_char_delete_in_text_contexts
2026-08-18T01:42:32.3657852Z         PASS [   0.120s] ( 471/2580) spt::bin/spt picker::tests::purge_outcomes_convert_to_flash_lines
2026-08-18T01:42:32.3770535Z         PASS [   0.124s] ( 472/2580) spt::bin/spt picker::tests::purge_transition_reconstructs_the_complete_screen_after_external_mutation
2026-08-18T01:42:32.3772258Z         PASS [   0.119s] ( 473/2580) spt::bin/spt picker::view::tests::adapter_tree_buffer
2026-08-18T01:42:32.3817132Z         PASS [   0.117s] ( 474/2580) spt::bin/spt api::startup::tests::fresh_bind_over_dead_life_needs_both_terminal_and_a_new_session
2026-08-18T01:42:32.3951707Z         PASS [   0.124s] ( 475/2580) spt::bin/spt picker::view::tests::change_adapter_screen_renders_tree_and_apply_legend
2026-08-18T01:42:32.4011482Z         PASS [   0.127s] ( 476/2580) spt::bin/spt picker::view::tests::choose_project_buffer_keeps_confirm_panel
2026-08-18T01:42:32.4158108Z         PASS [   0.138s] ( 477/2580) spt::bin/spt picker::view::tests::confirm_buffer_options
2026-08-18T01:42:32.4168161Z         PASS [   0.109s] ( 478/2580) spt::bin/spt picker::view::tests::confirm_fork_and_shortcut_labels_are_dir_relative
2026-08-18T01:42:32.4200508Z         PASS [   0.058s] ( 479/2580) spt::bin/spt picker::view::tests::create_home_lists_subnets
2026-08-18T01:42:32.4269870Z         PASS [   0.069s] ( 480/2580) spt::bin/spt picker::view::tests::confirm_panel_history_renders_display_not_slug
2026-08-18T01:42:32.4322135Z         PASS [   0.066s] ( 481/2580) spt::bin/spt picker::view::tests::every_picker_list_view_keeps_its_caret_on_screen
2026-08-18T01:42:32.4835821Z         PASS [   0.107s] ( 482/2580) spt::bin/spt picker::view::tests::kind_buffer
2026-08-18T01:42:32.5064435Z         PASS [   0.112s] ( 483/2580) spt::bin/spt picker::view::tests::pick_buffer_has_squares_and_description
2026-08-18T01:42:32.5106949Z         PASS [   0.109s] ( 484/2580) spt::bin/spt picker::view::tests::pick_empty_category_hint
2026-08-18T01:42:32.5125184Z         PASS [   0.136s] ( 485/2580) spt::bin/spt picker::view::tests::footer_hints_h_s_only_when_launch_keys_live
2026-08-18T01:42:32.5257982Z         PASS [   0.109s] ( 486/2580) spt::bin/spt picker::view::tests::resume_buffer_keeps_confirm_panel
2026-08-18T01:42:32.5310061Z         PASS [   0.111s] ( 487/2580) spt::bin/spt picker::view::tests::resume_buffer_lists_sessions
2026-08-18T01:42:32.5389797Z         PASS [   0.112s] ( 488/2580) spt::bin/spt picker::view::tests::the_caret_row_accounts_for_the_group_headers_above_it
2026-08-18T01:42:32.5500422Z         PASS [   0.066s] ( 489/2580) spt::bin/spt rc::tests::a_bringable_target_reaches_bring_up_with_the_offline_row_present
2026-08-18T01:42:32.5516238Z         PASS [   0.046s] ( 490/2580) spt::bin/spt rc::tests::a_refusal_names_the_targets_own_entry_surface
2026-08-18T01:42:32.5548850Z         PASS [   0.123s] ( 491/2580) spt::bin/spt picker::view::tests::the_caret_stays_on_screen_when_the_list_outruns_the_viewport
2026-08-18T01:42:32.5632040Z         PASS [   0.051s] ( 492/2580) spt::bin/spt rc::tests::attach_gate_routes_on_session_truth_not_the_row
2026-08-18T01:42:32.5741960Z         PASS [   0.043s] ( 493/2580) spt::bin/spt rc::tests::bracketed_paste_framing_is_exact_and_content_verbatim
2026-08-18T01:42:32.5811052Z         PASS [   0.042s] ( 494/2580) spt::bin/spt rc::tests::bringable_is_the_engine_room_addressed_plainly_with_a_code
2026-08-18T01:42:32.5818466Z         PASS [   0.072s] ( 495/2580) spt::bin/spt rc::tests::attach_against_stopped_daemon_never_spawns_and_exits_loud
2026-08-18T01:42:32.5847171Z         PASS [   0.035s] ( 496/2580) spt::bin/spt rc::tests::bringup_prompt_names_the_node_and_the_home_subnet
2026-08-18T01:42:32.5893470Z         PASS [   0.174s] ( 497/2580) spt::bin/spt picker::view::tests::pick_status_line_four_state
2026-08-18T01:42:32.6043149Z         PASS [   0.079s] ( 498/2580) spt::bin/spt rc::tests::attach_offline_endpoint_short_circuits_clean
2026-08-18T01:42:32.6482692Z         PASS [   0.096s] ( 499/2580) spt::bin/spt rc::tests::canonical_wire_id_strips_qualifiers_to_the_bare_id
2026-08-18T01:42:32.6544023Z         PASS [   0.099s] ( 500/2580) spt::bin/spt rc::tests::classify_read_err_eof_is_graceful_not_fatal
2026-08-18T01:42:32.6611715Z         PASS [   0.097s] ( 501/2580) spt::bin/spt rc::tests::clipboard_paste_wraps_nonempty_and_noops_on_empty_or_failure
2026-08-18T01:42:32.6627528Z         PASS [   0.281s] ( 502/2580) spt::bin/spt api::startup::tests::fresh_create_over_a_stopped_life_reads_active_with_no_wake
2026-08-18T01:42:32.6678517Z         PASS [   0.094s] ( 503/2580) spt::bin/spt rc::tests::detach_keybind_semantics
2026-08-18T01:42:32.6798982Z         PASS [   0.098s] ( 504/2580) spt::bin/spt rc::tests::display_guard_postlude_exactly_once_and_inactive_silent
2026-08-18T01:42:32.6799612Z         PASS [   0.099s] ( 505/2580) spt::bin/spt rc::tests::detach_prefix_spans_chunks
2026-08-18T01:42:32.6823516Z         PASS [   0.098s] ( 506/2580) spt::bin/spt rc::tests::driver_phrase_names_own_node_plainly_but_remote_verbatim
2026-08-18T01:42:32.6928621Z         PASS [   0.088s] ( 507/2580) spt::bin/spt rc::tests::first_event_stall_decision
2026-08-18T01:42:32.6971693Z         PASS [   0.049s] ( 508/2580) spt::bin/spt rc::tests::fold_code_key_prompt_rules
2026-08-18T01:42:32.7030330Z         PASS [   0.049s] ( 509/2580) spt::bin/spt rc::tests::give_up_copy_names_daemon_down_vs_generic
2026-08-18T01:42:32.7091272Z         PASS [   0.049s] ( 510/2580) spt::bin/spt rc::tests::harness_only_row_matches_online_seatless_live_agents_only
2026-08-18T01:42:32.7176695Z         PASS [   0.050s] ( 511/2580) spt::bin/spt rc::tests::identity_line_format
2026-08-18T01:42:32.7764504Z         PASS [   0.097s] ( 512/2580) spt::bin/spt rc::tests::key_event_step_detach_sm
2026-08-18T01:42:32.7829693Z         PASS [   0.103s] ( 513/2580) spt::bin/spt rc::tests::mouse_is_paste_only_right_button_down
2026-08-18T01:42:32.7899017Z         PASS [   0.107s] ( 514/2580) spt::bin/spt rc::tests::mouse_mode_decset_scan_survives_split_across_chunks
2026-08-18T01:42:32.7979089Z         PASS [   0.105s] ( 515/2580) spt::bin/spt rc::tests::mouse_mode_decset_scan_tracks_enable_and_sgr
2026-08-18T01:42:32.8085201Z         PASS [   0.146s] ( 516/2580) spt::bin/spt api::startup::tests::fresh_create_with_no_prior_carries_no_rest_state
2026-08-18T01:42:32.8086048Z         PASS [   0.111s] ( 517/2580) spt::bin/spt rc::tests::op_minter_distinct_and_monotonic
2026-08-18T01:42:32.8174651Z         PASS [   0.114s] ( 518/2580) spt::bin/spt rc::tests::pre_broker_busy_guidance_fires_for_any_driver_not_just_remote
2026-08-18T01:42:32.8212593Z         PASS [   0.112s] ( 519/2580) spt::bin/spt rc::tests::public_attach_failure_maps_deadline_class_only
2026-08-18T01:42:32.8276586Z         PASS [   0.109s] ( 520/2580) spt::bin/spt rc::tests::pump_status_emit_sequence_over_write_sink
2026-08-18T01:42:32.8337230Z         PASS [   0.057s] ( 521/2580) spt::bin/spt rc::tests::reassert_scanner_survives_split_across_chunks
2026-08-18T01:42:32.8395804Z         PASS [   0.057s] ( 522/2580) spt::bin/spt rc::tests::reassert_scanner_triggers_only_on_region_destroyers
2026-08-18T01:42:32.8421798Z         PASS [   0.253s] ( 523/2580) spt::bin/spt rc::tests::establish_attach_reuses_the_probes_carried_pump_conn
2026-08-18T01:42:32.8465700Z         PASS [   0.057s] ( 524/2580) spt::bin/spt rc::tests::reconnect_banner_clears_and_centers
2026-08-18T01:42:32.8508909Z         PASS [   0.053s] ( 525/2580) spt::bin/spt rc::tests::reconnect_banner_shows_the_countdown
2026-08-18T01:42:32.8563097Z         PASS [   0.048s] ( 526/2580) spt::bin/spt api::startup::tests::listen_never_asserts_hosting_topology_and_bind_still_does
2026-08-18T01:42:32.8627405Z         PASS [   0.054s] ( 527/2580) spt::bin/spt rc::tests::reconnect_remaining_secs_counts_down_ceil
2026-08-18T01:42:32.8661603Z         PASS [   6.835s] ( 528/2580) spt::bin/spt cli::tests::a_remote_fork_refuses_delete_source_whole_rather_than_trimming_it
2026-08-18T01:42:32.8683809Z         PASS [   0.051s] ( 529/2580) spt::bin/spt rc::tests::reconnect_window_expiry_decision
2026-08-18T01:42:32.9353864Z         PASS [   0.114s] ( 530/2580) spt::bin/spt rc::tests::scroll_dir_classifies_wheel_only
2026-08-18T01:42:32.9396203Z         PASS [   0.111s] ( 531/2580) spt::bin/spt rc::tests::scroll_sgr_emits_exact_xterm_bytes
2026-08-18T01:42:32.9643435Z         PASS [   0.124s] ( 532/2580) spt::bin/spt rc::tests::status_assert_reserves_row1_then_repaints
2026-08-18T01:42:32.9646898Z         PASS [   0.130s] ( 533/2580) spt::bin/spt rc::tests::serve_eof_severed_vs_refused
2026-08-18T01:42:32.9721787Z         PASS [   0.129s] ( 534/2580) spt::bin/spt rc::tests::status_repaint_exact_bytes_and_right_align
2026-08-18T01:42:32.9814019Z         PASS [   0.130s] ( 535/2580) spt::bin/spt rc::tests::status_row_marker_is_disabled_by_flag
2026-08-18T01:42:32.9831965Z         PASS [   0.136s] ( 536/2580) spt::bin/spt rc::tests::status_restore_exact_bytes
2026-08-18T01:42:32.9832738Z         PASS [   0.127s] ( 537/2580) spt::bin/spt api::startup::tests::listen_online_gate_refuses_capability_only_online
2026-08-18T01:42:32.9883249Z         PASS [   0.125s] ( 538/2580) spt::bin/spt rc::tests::status_update_size_repoints_geometry
2026-08-18T01:42:32.9926987Z         PASS [   0.126s] ( 539/2580) spt::bin/spt rc::tests::teardown_matrix_postlude_precedes_prose_across_every_final_class
2026-08-18T01:42:32.9964973Z         PASS [   0.128s] ( 540/2580) spt::bin/spt rc::tests::the_client_refuses_engine_room_viewports_and_qualified_targets_only
2026-08-18T01:42:33.0019845Z         PASS [   0.067s] ( 541/2580) spt::bin/spt rc::tests::translate_key_event_emits_exact_xterm_vt
2026-08-18T01:42:33.0077244Z         PASS [   0.070s] ( 542/2580) spt::bin/spt rc::tests::with_vt_output_disables_newline_auto_return
2026-08-18T01:42:33.0593967Z         PASS [   0.096s] ( 543/2580) spt::bin/spt rc::tests::with_vt_output_enables_virtual_terminal_processing
2026-08-18T01:42:33.0902915Z         PASS [   0.125s] ( 544/2580) spt::bin/spt roster::tests::detect_self_by_ancestry_none_when_no_ancestor_owns_a_perch
2026-08-18T01:42:33.0981559Z         PASS [   0.115s] ( 545/2580) spt::bin/spt api::startup::tests::listen_orphan_exit_line_names_self_and_parent
2026-08-18T01:42:33.1032893Z         PASS [   0.132s] ( 546/2580) spt::bin/spt roster::tests::detect_self_by_ancestry_resolves_a_live_ancestor_perch
2026-08-18T01:42:33.1047483Z         PASS [   0.124s] ( 547/2580) spt::bin/spt roster::tests::detect_self_id_endpoint_id_leg_is_label_only_and_perch_gated
2026-08-18T01:42:33.1265151Z         PASS [   0.129s] ( 548/2580) spt::bin/spt roster::tests::enumerate_yields_offline_corrupt_row_for_unparseable_info
2026-08-18T01:42:33.1266033Z         PASS [   0.144s] ( 549/2580) spt::bin/spt roster::tests::detect_self_id_resolves_identity_with_zero_git_spawns
2026-08-18T01:42:33.1308684Z         PASS [   0.143s] ( 550/2580) spt::bin/spt roster::tests::detect_self_resolves_spt_hosted_perch_via_parent_pid
2026-08-18T01:42:33.1599443Z         PASS [   0.158s] ( 551/2580) spt::bin/spt roster::tests::list_all_perch_dirs_enumerates_nested_psyche_for_self_resolution
2026-08-18T01:42:33.1811393Z         PASS [   0.173s] ( 552/2580) spt::bin/spt roster::tests::match_self_by_ancestry_disambiguates_and_none
2026-08-18T01:42:33.1951493Z         PASS [   0.104s] ( 553/2580) spt::bin/spt teardown::tests::an_unconfirmed_row_over_a_dead_root_is_stale_not_a_survivor
2026-08-18T01:42:33.1967416Z         PASS [   0.204s] ( 554/2580) spt::bin/spt roster::tests::enumerate_nested_keeps_a_child_whose_name_has_no_kind_suffix
2026-08-18T01:42:33.2154009Z         PASS [   0.109s] ( 555/2580) spt::bin/spt teardown::tests::timeout_refuses_the_stamp_and_names_the_survivor
2026-08-18T01:42:33.2212058Z         PASS [   0.159s] ( 556/2580) spt::bin/spt roster::tests::parent_pid_candidates_stay_ancestry_gated
2026-08-18T01:42:33.2248081Z         PASS [   2.363s] ( 557/2580) spt::bin/spt cli::tests::the_monic_command_path_treats_a_husk_as_present
2026-08-18T01:42:33.2349008Z         PASS [   0.108s] ( 558/2580) spt::bin/spt teardown::tests::topology_gate_is_controllable_true_only
2026-08-18T01:42:33.2455325Z         PASS [   0.118s] ( 559/2580) spt::bin/spt tests::broken_pipe_panic_classifier
2026-08-18T01:42:33.2481832Z         PASS [   0.148s] ( 560/2580) spt::bin/spt api::startup::tests::live_perch_under_other_session_conflicts
2026-08-18T01:42:33.2553478Z         PASS [   0.124s] ( 561/2580) spt::bin/spt tests::the_sized_stack_wrapper_maps_a_panic_to_the_main_thread_code
2026-08-18T01:42:33.2571900Z         PASS [   0.097s] ( 562/2580) spt::bin/spt trustwarnverb::tests::a_refusal_names_the_verb_the_endpoint_and_the_reason
2026-08-18T01:42:33.2591823Z         PASS [   0.156s] ( 563/2580) spt::bin/spt teardown::tests::liveness_proof_needs_a_real_snapshot_and_finds_this_process
2026-08-18T01:42:33.3011239Z         PASS [   0.120s] ( 564/2580) spt::bin/spt trustwarnverb::tests::showing_the_warning_is_never_elevation_gated
2026-08-18T01:42:33.3106907Z         PASS [   0.117s] ( 565/2580) spt::bin/spt trustwarnverb::tests::the_gate_keys_on_whether_the_verb_writes
2026-08-18T01:42:33.3133560Z         PASS [   0.116s] ( 566/2580) spt::bin/spt trustwarnverb::tests::writing_an_override_requires_confirmed_elevation
2026-08-18T01:42:33.3223758Z         PASS [   0.108s] ( 567/2580) spt::bin/spt unlisted::tests::a_cross_node_knock_says_answer_unknown_while_a_same_node_one_says_approved
2026-08-18T01:42:33.3313957Z         PASS [   0.111s] ( 568/2580) spt::bin/spt unlisted::tests::a_rule_only_row_has_no_node_to_route_to
2026-08-18T01:42:33.3339709Z         PASS [   0.110s] ( 569/2580) spt::bin/spt unlisted::tests::an_exclusion_and_an_unheard_of_id_are_different_refusals
2026-08-18T01:42:33.3436453Z         PASS [   0.110s] ( 570/2580) spt::bin/spt unlisted::tests::an_exclusion_outranks_the_strongest_evidence
2026-08-18T01:42:33.3530629Z         PASS [   0.108s] ( 571/2580) spt::bin/spt unlisted::tests::an_inbound_knock_is_never_read_as_our_own_outbound_act
2026-08-18T01:42:33.3629900Z         PASS [   0.108s] ( 572/2580) spt::bin/spt unlisted::tests::contact_evidence_outside_the_window_produces_no_row
2026-08-18T01:42:33.3641648Z         PASS [   0.118s] ( 573/2580) spt::bin/spt api::startup::tests::missing_seed_refused
2026-08-18T01:42:33.3701623Z         PASS [   0.113s] ( 574/2580) spt::bin/spt unlisted::tests::listed_local_and_excluded_rows_are_dropped_and_the_rest_survive
2026-08-18T01:42:33.4357148Z         PASS [   0.176s] ( 575/2580) spt::bin/spt unlisted::tests::no_evidence_phrase_claims_liveness
2026-08-18T01:42:33.4426819Z         PASS [   0.141s] ( 576/2580) spt::bin/spt unlisted::tests::no_knock_evidence_phrase_claims_liveness
2026-08-18T01:42:33.4465321Z         PASS [   0.136s] ( 577/2580) spt::bin/spt unlisted::tests::rule_evidence_carries_no_node_and_contact_evidence_does
2026-08-18T01:42:33.4501826Z         PASS [   0.137s] ( 578/2580) spt::bin/spt unlisted::tests::the_relative_stamp_is_coarse_and_has_no_zero_forms
2026-08-18T01:42:33.4554910Z         PASS [   0.134s] ( 579/2580) spt::bin/spt unlisted::tests::the_route_refuses_an_excluded_id_and_admits_a_non_excluded_one
2026-08-18T01:42:33.4605164Z         PASS [   0.131s] ( 580/2580) spt::bin/spt unlisted::tests::the_strongest_provenance_labels_the_row_and_a_weaker_one_supplies_the_node
2026-08-18T01:42:33.4697569Z         PASS [   0.126s] ( 581/2580) spt-daemon access::tests::a_sender_endpoint_rule_does_not_admit_a_fork
2026-08-18T01:42:33.4952551Z         PASS [   0.161s] ( 582/2580) spt-daemon access::tests::a_fork_grant_admits_fork_and_nothing_else_admits_fork
2026-08-18T01:42:33.4956866Z         PASS [   0.142s] ( 583/2580) spt-daemon access::tests::corrupt_store_degrades_closed_but_replies_survive
2026-08-18T01:42:33.5082613Z         PASS [   0.142s] ( 584/2580) spt-daemon access::tests::discover_gate_discloses_per_viewer
2026-08-18T01:42:33.5158665Z         PASS [   0.145s] ( 585/2580) spt-daemon access::tests::discover_gate_withholds_everything_while_degraded
2026-08-18T01:42:33.5201059Z         PASS [   0.154s] ( 586/2580) spt::bin/spt api::startup::tests::no_seed_is_the_fallback_trigger_then_sid_binds
2026-08-18T01:42:33.5216596Z         PASS [   0.078s] ( 587/2580) spt-daemon access::tests::gate_feeds_the_proven_sender_endpoint_tier
2026-08-18T01:42:33.5244333Z         PASS [   0.089s] ( 588/2580) spt-daemon access::tests::gate_decision_table
2026-08-18T01:42:33.5366111Z         PASS [   0.086s] ( 589/2580) spt-daemon access::tests::reply_passes_where_unsolicited_refused
2026-08-18T01:42:33.5367051Z         PASS [   0.076s] ( 590/2580) spt-daemon access::tests::the_decision_helpers_split_pass_from_refusal_for_every_reason
2026-08-18T01:42:33.5440492Z         PASS [   0.097s] ( 591/2580) spt-daemon access::tests::gate_is_per_surface
2026-08-18T01:42:33.5605133Z         PASS [   0.105s] ( 592/2580) spt-daemon access::tests::same_node_always_passes_without_minting
2026-08-18T01:42:33.5960207Z         PASS [   0.099s] ( 593/2580) spt-daemon access::tests::the_inbound_lock_answers_replies_only_and_only_while_controlled
2026-08-18T01:42:33.6071929Z         PASS [   0.092s] ( 594/2580) spt-daemon access::tests::the_knock_exemption_hook_refuses_everything_today
2026-08-18T01:42:33.6127265Z         PASS [   0.094s] ( 595/2580) spt::bin/spt api::startup::tests::only_an_unverified_refusal_names_its_escape
2026-08-18T01:42:33.6220581Z         PASS [   0.127s] ( 596/2580) spt-daemon access::tests::the_engine_room_refuses_even_this_nodes_own_unsolicited_inbound
2026-08-18T01:42:33.6223571Z         PASS [   0.117s] ( 597/2580) spt-daemon access::tests::the_inbound_lock_is_reached_through_the_sender_stamped_entry_point
2026-08-18T01:42:33.6250933Z         PASS [   0.101s] ( 598/2580) spt-daemon access::tests::the_trust_warning_fires_only_for_an_entry_admitted_stranger
2026-08-18T01:42:33.6389734Z         PASS [   0.102s] ( 599/2580) spt-daemon activity::tests::a_state_change_owes_a_push_both_directions
2026-08-18T01:42:33.6392427Z         PASS [   0.103s] ( 600/2580) spt-daemon access::tests::the_wire_origin_stamp_reaches_the_chain
2026-08-18T01:42:33.6400227Z         PASS [   0.096s] ( 601/2580) spt-daemon activity::tests::a_token_change_with_an_identical_state_owes_a_push
2026-08-18T01:42:33.6451612Z         PASS [   0.085s] ( 602/2580) spt-daemon activity::tests::an_identical_observation_pushes_nothing
2026-08-18T01:42:33.6508617Z         PASS [   0.181s] ( 603/2580) spt-daemon access::tests::the_engine_room_is_disclosed_only_to_the_viewers_it_chose
2026-08-18T01:42:33.6574920Z         PASS [   0.049s] ( 604/2580) spt-daemon activity::tests::an_unseen_link_owes_a_push
2026-08-18T01:42:33.6620605Z         PASS [   0.049s] ( 605/2580) spt::bin/spt api::startup::tests::only_gone_changes_the_conflict_verdict
2026-08-18T01:42:33.6670701Z         PASS [   0.073s] ( 606/2580) spt-daemon activity::tests::an_owner_with_no_linked_shell_is_not_observed
2026-08-18T01:42:33.6689377Z         PASS [   0.148s] ( 607/2580) spt-daemon access::tests::the_pass_reason_names_which_arm_admitted_the_interaction
2026-08-18T01:42:33.6747624Z         PASS [   0.052s] ( 608/2580) spt-daemon activity::tests::observe_links_on_an_absent_owlery_is_empty
2026-08-18T01:42:33.6783108Z         PASS [   0.056s] ( 609/2580) spt-daemon activity::tests::an_unstamped_owner_observes_undated_and_stays_silent_across_sweeps
2026-08-18T01:42:33.6836749Z         PASS [   0.045s] ( 610/2580) spt-daemon activity::tests::remember_forgets_a_vanished_link_so_its_return_re_pushes
2026-08-18T01:42:33.6908825Z         PASS [   0.066s] ( 611/2580) spt-daemon activity::tests::observe_links_sees_only_online_shells_holding_a_token
2026-08-18T01:42:33.7402911Z         PASS [   0.101s] ( 612/2580) spt-daemon activity::tests::the_diff_is_per_link_not_per_owner
2026-08-18T01:42:33.7477678Z         PASS [   0.108s] ( 613/2580) spt-daemon activity::tests::the_flip_marker_is_idempotent_to_drop_and_taken_exactly_once
2026-08-18T01:42:33.7521533Z         PASS [   0.106s] ( 614/2580) spt-daemon adapter_update::tests::delegated_attested_delegates_command
2026-08-18T01:42:33.7564552Z         PASS [   0.106s] ( 615/2580) spt-daemon adapter_update::tests::delegated_unattested_is_skipped
2026-08-18T01:42:33.7722023Z         PASS [   0.115s] ( 616/2580) spt-daemon adapter_update::tests::file_pull_tampered_bytes_rejected
2026-08-18T01:42:33.7756835Z         PASS [   0.107s] ( 617/2580) spt-daemon adapter_update::tests::file_pull_without_payload_is_skipped
2026-08-18T01:42:33.7797263Z         PASS [   0.113s] ( 618/2580) spt-daemon adapter_update::tests::file_pull_verified_against_adapter_key
2026-08-18T01:42:33.7835235Z         PASS [   0.105s] ( 619/2580) spt-daemon adapter_update::tests::gh_release_is_managed_cli_side_not_in_pure_plan
2026-08-18T01:42:33.7887462Z         PASS [   0.114s] ( 620/2580) spt-daemon adapter_update::tests::file_pull_wrong_key_rejected
2026-08-18T01:42:33.7983413Z         PASS [   0.114s] ( 621/2580) spt-daemon adapter_update::tests::ripple_conducts_each_adapter_in_order
2026-08-18T01:42:33.8414434Z         PASS [   0.179s] ( 622/2580) spt::bin/spt api::startup::tests::parent_watchdog_triggers_exit_on_a_dead_parent_only
2026-08-18T01:42:33.8492686Z         PASS [   0.069s] ( 623/2580) spt-daemon attach::tests::the_engine_room_has_no_viewport_and_takes_its_controls_from_home
2026-08-18T01:42:33.8784773Z         PASS [   0.094s] ( 624/2580) spt-daemon attach::tests::viewer_and_driving_intents_gate_on_different_surfaces
2026-08-18T01:42:33.8798861Z         PASS [   0.131s] ( 625/2580) spt-daemon answerop::tests::a_receipt_fires_only_from_the_node_the_knock_was_sent_to
2026-08-18T01:42:33.8801380Z         PASS [   0.104s] ( 626/2580) spt-daemon answerop::tests::an_unknown_outcome_token_acts_on_nothing
2026-08-18T01:42:33.8802938Z         PASS [   0.189s] ( 627/2580) spt-daemon adapter_update::tests::ripple_registered_uses_the_registered_set
2026-08-18T01:42:33.9061328Z         PASS [   0.057s] ( 628/2580) spt-daemon autostart::tests::unresolved_adapter_loud_skips_before_any_launch
2026-08-18T01:42:34.0050375Z         PASS [   0.265s] ( 629/2580) spt-daemon answerop::tests::a_denial_disarms_but_only_when_it_is_proven
2026-08-18T01:42:34.0618914Z         PASS [   0.220s] ( 630/2580) spt::bin/spt api::startup::tests::post_spawn_bind_establishes_perch
2026-08-18T01:42:34.1300958Z         PASS [   0.331s] ( 631/2580) spt-daemon autostart::tests::empty_config_is_a_pure_noop
2026-08-18T01:42:34.1369773Z         PASS [   0.259s] ( 632/2580) spt-daemon brain::tests::a_flagged_sync_frame_baselines_forward_never_backward_on_both_paths
2026-08-18T01:42:34.1456883Z         PASS [   0.264s] ( 633/2580) spt-daemon brain::tests::an_old_broker_wire_without_the_sync_key_keeps_every_legacy_path
2026-08-18T01:42:34.1461174Z         PASS [   0.266s] ( 634/2580) spt-daemon brain::tests::cold_brain_still_rejects_a_forward_output_gap
2026-08-18T01:42:34.1483901Z         PASS [   0.268s] ( 635/2580) spt-daemon brain::tests::controller_resume_from_floor_refetches_after_a_gap
2026-08-18T01:42:34.1555470Z         PASS [   0.249s] ( 636/2580) spt-daemon brain::tests::peer_reply_deadline_caps_below_carrier_deadline
2026-08-18T01:42:34.1614090Z         PASS [   0.156s] ( 637/2580) spt-daemon brain::tests::reclassify_peer_reply_maps_timeout_off_poison
2026-08-18T01:42:34.1689541Z         PASS [   0.397s] ( 638/2580) spt-daemon answerop::tests::an_approval_notifies_a_plain_knocker_with_no_pre_authorization
2026-08-18T01:42:34.1956707Z         PASS [   0.444s] ( 639/2580) spt-daemon answerop::tests::a_receipt_for_a_knock_we_never_sent_notifies_nobody
2026-08-18T01:42:34.2256092Z         PASS [   0.096s] ( 640/2580) spt-daemon brain::tests::skip_to_live_accepts_a_forward_seq_jump_via_snap_above
2026-08-18T01:42:34.2284747Z         PASS [   0.092s] ( 641/2580) spt-daemon brain::tests::viewer_snap_attach_accepts_a_forward_output_gap
2026-08-18T01:42:34.2318796Z         PASS [   0.088s] ( 642/2580) spt-daemon brainproc::tests::appended_padding_flips_exe_hash
2026-08-18T01:42:34.2389988Z         PASS [   0.093s] ( 643/2580) spt-daemon brainproc::tests::backoff_doubles_on_fast_death_resets_when_healthy
2026-08-18T01:42:34.2456344Z         PASS [   0.097s] ( 644/2580) spt-daemon brainproc::tests::brain_child_args_carry_generation_and_reason
2026-08-18T01:42:34.2514084Z         PASS [   0.096s] ( 645/2580) spt-daemon brainproc::tests::bytes_gate_truth_table
2026-08-18T01:42:34.2523544Z         PASS [   0.496s] ( 646/2580) spt-daemon answerop::tests::a_receipt_from_the_wrong_answerer_or_a_replayed_one_acts_on_nothing
2026-08-18T01:42:34.2626577Z         PASS [   0.094s] ( 647/2580) spt-daemon brainproc::tests::consumer_gate_spawns_once_when_net_enabled
2026-08-18T01:42:34.2709420Z         PASS [   0.209s] ( 648/2580) spt::bin/spt api::startup::tests::prebind_refusal_restores_the_seed_for_retry
2026-08-18T01:42:34.3411730Z         PASS [   0.115s] ( 649/2580) spt-daemon brainproc::tests::planned_restart_respawns_with_update_reason
2026-08-18T01:42:34.3515276Z         PASS [   0.119s] ( 650/2580) spt-daemon brainproc::tests::ready_but_wrong_bytes_rolls_back_never_promotes
2026-08-18T01:42:34.3561199Z         PASS [   0.110s] ( 651/2580) spt-daemon brainproc::tests::ready_exe_hash_parses_and_is_n1_readable
2026-08-18T01:42:34.3652028Z         PASS [   0.113s] ( 652/2580) spt-daemon brainproc::tests::ready_generation_parses_stamp_and_fails_safe
2026-08-18T01:42:34.3694951Z         PASS [   0.118s] ( 653/2580) spt-daemon brainproc::tests::ready_generation_at_reads_file_and_absent_is_none
2026-08-18T01:42:34.3783062Z         PASS [   0.107s] ( 654/2580) spt::bin/spt api::startup::tests::read_env_measured_capture_replaces_prior_stamp
2026-08-18T01:42:34.3826569Z         PASS [   0.042s] ( 655/2580) spt-daemon brainproc::tests::rollback_running_version_is_prior_not_n_minus_one
2026-08-18T01:42:34.3896068Z         PASS [   6.136s] ( 656/2580) spt::bin/spt cli::tests::purge_removes_every_record
2026-08-18T01:42:34.3939001Z         PASS [   0.038s] ( 657/2580) spt-daemon brainproc::tests::select_brain_exe_prefers_canonical_over_per_spawn_current_exe
2026-08-18T01:42:34.4022968Z         PASS [   0.051s] ( 658/2580) spt-daemon brainproc::tests::rolled_back_record_spawns_rollback_binary_on_a_fresh_supervisor
2026-08-18T01:42:34.4049333Z         PASS [   0.035s] ( 659/2580) spt-daemon brainproc::tests::start_reason_arg_round_trips_and_is_lenient
2026-08-18T01:42:34.5280405Z         PASS [   0.150s] ( 660/2580) spt::bin/spt api::startup::tests::rebind_same_session_ok
2026-08-18T01:42:34.6120971Z         PASS [   0.373s] ( 661/2580) spt-daemon brainproc::tests::ready_candidate_promotes_once_old_gen_drains
2026-08-18T01:42:34.6672881Z         PASS [   0.404s] ( 662/2580) spt-daemon brainproc::tests::ready_with_matching_bytes_promotes
2026-08-18T01:42:34.6834215Z         PASS [   0.071s] ( 663/2580) spt-daemon codec::tests::back_to_back_frames_decode_independently
2026-08-18T01:42:34.6862660Z         PASS [   0.019s] ( 664/2580) spt-daemon codec::tests::frame_round_trips_through_buffer
2026-08-18T01:42:34.6974166Z         PASS [   0.014s] ( 665/2580) spt-daemon codec::tests::oversized_prefix_rejected
2026-08-18T01:42:34.7141841Z         PASS [   0.028s] ( 666/2580) spt-daemon config::tests::auto_suspend_knob_is_opt_in_default_off
2026-08-18T01:42:34.7274873Z         LEAK [   0.566s] ( 667/2580) spt-daemon brainproc::tests::clear_before_spawn_defeats_exact_generation_stale_file
2026-08-18T01:42:34.7651659Z         PASS [   0.068s] ( 668/2580) spt-daemon config::tests::crash_grace_is_config_driven
2026-08-18T01:42:34.7746258Z         PASS [   0.059s] ( 669/2580) spt-daemon config::tests::detached_subnets_knob_defaults_empty
2026-08-18T01:42:34.7747178Z         LEAK [   0.545s] ( 670/2580) spt-daemon brainproc::tests::ready_but_old_gen_never_drains_does_not_promote_rolls_back
2026-08-18T01:42:34.7788940Z         PASS [   0.051s] ( 671/2580) spt-daemon config::tests::full_auto_update_is_gated_by_default
2026-08-18T01:42:34.7833071Z         PASS [   0.381s] ( 672/2580) spt-daemon brainproc::tests::trial_promotes_on_ready_then_supervises_the_accepted_binary
2026-08-18T01:42:34.7982705Z         PASS [   0.032s] ( 673/2580) spt-daemon config::tests::malformed_file_degrades_to_default
2026-08-18T01:42:34.7989110Z         PASS [   0.025s] ( 674/2580) spt-daemon config::tests::missing_file_is_default
2026-08-18T01:42:34.8359510Z         PASS [   0.308s] ( 675/2580) spt::bin/spt api::startup::tests::revive_preserves_prior_rest_state_and_dormant_anchor
2026-08-18T01:42:34.8439498Z         PASS [   0.070s] ( 676/2580) spt-daemon config::tests::pulse_period_is_config_driven
2026-08-18T01:42:34.8733480Z         PASS [   0.094s] ( 677/2580) spt-daemon config::tests::relay_choice_is_config_driven
2026-08-18T01:42:34.8739204Z         PASS [   0.075s] ( 678/2580) spt-daemon config::tests::save_load_roundtrip
2026-08-18T01:42:34.8878779Z         PASS [   0.089s] ( 679/2580) spt-daemon config::tests::startup_endpoints_roundtrip
2026-08-18T01:42:34.8891101Z         PASS [   0.106s] ( 680/2580) spt-daemon config::tests::remove_startup_endpoint_takes_one_entry_and_reports_whether_there_was_one
2026-08-18T01:42:34.8894005Z         PASS [   0.017s] ( 681/2580) spt-daemon conn::tests::conn_ids_are_unique_and_labels_stay_bounded
2026-08-18T01:42:34.8962630Z         PASS [   0.023s] ( 682/2580) spt-daemon conn::tests::organic_write_failure_still_poisons_and_is_not_the_timeout_class
2026-08-18T01:42:34.9135306Z         PASS [   0.023s] ( 683/2580) spt-daemon conn::tests::retirement_token_splits_deadline_from_organic_with_attribution_parity
2026-08-18T01:42:34.9158153Z         PASS [   0.071s] ( 684/2580) spt-daemon config::tests::upsert_startup_endpoint_appends_then_replaces_preserving_other_knobs
2026-08-18T01:42:34.9168616Z         PASS [   7.703s] ( 685/2580) spt::bin/spt cli::tests::fork_forks_homes_and_deletes_exactly_the_source
2026-08-18T01:42:34.9180814Z         PASS [   0.029s] ( 686/2580) spt-daemon consent::tests::decide_honors_full_auto_flag
2026-08-18T01:42:34.9765718Z         PASS [   0.586s] ( 687/2580) spt-daemon brainproc::tests::supervisor_respawns_brain_until_stopped
2026-08-18T01:42:34.9803181Z         PASS [   0.597s] ( 688/2580) spt-daemon brainproc::tests::supervisor_owns_generation_and_stamps_start_reason
2026-08-18T01:42:35.0003073Z         PASS [   0.089s] ( 689/2580) spt-daemon crc_swap::tests::apply_rollback_never_strands
2026-08-18T01:42:35.0165885Z         PASS [   0.178s] ( 690/2580) spt::bin/spt api::startup::tests::revive_without_cwd_preserves_prior_cwd
2026-08-18T01:42:35.0278152Z         PASS [   0.107s] ( 691/2580) spt-daemon crc_swap::tests::crash_recovery_missing_target_keeps_last_good_old
2026-08-18T01:42:35.0353169Z         PASS [   0.140s] ( 692/2580) spt-daemon consent::tests::no_live_session_resolves_to_none
2026-08-18T01:42:35.0358578Z         PASS [   0.115s] ( 693/2580) spt-daemon crc_swap::tests::displace_picks_fresh_old_name_and_gc_sweeps_stale
2026-08-18T01:42:35.0359323Z         PASS [   0.119s] ( 694/2580) spt-daemon crc_swap::tests::apply_swaps_changed_creates_new_untouched_identical
2026-08-18T01:42:35.0649121Z         PASS [   0.059s] ( 695/2580) spt-daemon crc_swap::tests::plan_selects_only_changed
2026-08-18T01:42:35.0779382Z         PASS [   0.080s] ( 696/2580) spt-daemon crc_swap::tests::plan_recurses_nested_dirs
2026-08-18T01:42:35.0839619Z         PASS [   0.070s] ( 697/2580) spt::bin/spt api::startup::tests::seed_bind_records_seed_captured_cwd
2026-08-18T01:42:35.0886968Z         PASS [   0.065s] ( 698/2580) spt-daemon crc_swap::tests::swap_error_carries_op_and_paths
2026-08-18T01:42:35.1024745Z         LEAK [   0.737s] ( 699/2580) spt-daemon brainproc::tests::stale_generation_minus_one_ready_never_promotes
2026-08-18T01:42:35.1163761Z         PASS [   0.220s] ( 700/2580) spt-daemon consent::tests::resolves_most_recently_active_live_session
2026-08-18T01:42:35.1468512Z         PASS [   0.117s] ( 701/2580) spt-daemon daemon::tests::a_captured_spawn_inherits_only_the_handle_in_its_allowlist
2026-08-18T01:42:35.1503399Z         PASS [   0.091s] ( 702/2580) spt-daemon daemon::tests::an_ordinary_teardown_announces_nothing
2026-08-18T01:42:35.1608797Z         PASS [   0.076s] ( 703/2580) spt::bin/spt api::startup::tests::seed_fail_eof_gives_actionable_stale_broker_hint
2026-08-18T01:42:35.1744121Z         PASS [   0.057s] ( 704/2580) spt-daemon daemon::tests::drive_ladder_all_err_returns_last_err
2026-08-18T01:42:35.1748483Z         PASS [   0.140s] ( 705/2580) spt-daemon daemon::tests::a_scrubbed_variable_never_reaches_the_child
2026-08-18T01:42:35.1756974Z         PASS [   0.142s] ( 706/2580) spt-daemon daemon::tests::a_failed_job_termination_announces_the_tree_loss
2026-08-18T01:42:35.1798286Z         PASS [   0.033s] ( 707/2580) spt-daemon daemon::tests::drive_ladder_falls_through_to_next_rung_on_err
2026-08-18T01:42:35.1798764Z         LEAK [   0.786s] ( 708/2580) spt-daemon brainproc::tests::trial_kills_alive_never_ready_candidate_before_rollback
2026-08-18T01:42:35.1821302Z         PASS [   0.032s] ( 709/2580) spt-daemon daemon::tests::drive_ladder_picks_first_ok_rung
2026-08-18T01:42:35.2265315Z         PASS [   0.251s] ( 710/2580) spt-daemon crc_swap::tests::mapped_old_does_not_brick_apply_displaces_aside
2026-08-18T01:42:35.2305423Z         PASS [   0.825s] ( 711/2580) spt-daemon brainproc::tests::trial_rolls_back_after_budget_of_pre_ready_exits
2026-08-18T01:42:35.2380671Z         PASS [   0.078s] ( 712/2580) spt::bin/spt api::startup::tests::seed_restorable_spends_dead_seeds_restores_recoverable
2026-08-18T01:42:35.2425806Z         PASS [   0.069s] ( 713/2580) spt-daemon daemon::tests::ensure_declines_only_against_a_standing_operator_stop
2026-08-18T01:42:35.2605832Z         PASS [   0.086s] ( 714/2580) spt-daemon daemon::tests::implicit_ensure_declines_without_clearing_the_inhibit
2026-08-18T01:42:35.2642697Z         PASS [   0.084s] ( 715/2580) spt-daemon daemon::tests::launch_ladder_order_is_wmi_schtasks_breakaway_injob
2026-08-18T01:42:35.2690034Z         PASS [   0.094s] ( 716/2580) spt-daemon daemon::tests::is_running_tracks_the_seed_channel
2026-08-18T01:42:35.2711653Z         PASS [   0.091s] ( 717/2580) spt-daemon daemon::tests::net_retry_backoff_doubles_then_caps
2026-08-18T01:42:35.2754121Z         PASS [   0.093s] ( 718/2580) spt-daemon daemon::tests::null_std_handles_only_on_a_pipe_stderr
2026-08-18T01:42:35.2863781Z         PASS [   0.056s] ( 719/2580) spt-daemon daemon::tests::the_refusal_line_names_the_remedy
2026-08-18T01:42:35.2965377Z         PASS [   0.054s] ( 720/2580) spt-daemon daemon::tests::the_tree_loss_line_names_the_loss_not_the_syscall
2026-08-18T01:42:35.3000216Z         PASS [   0.040s] ( 721/2580) spt-daemon daemon::tests::windows_arg_quoting_roundtrips_the_rules
2026-08-18T01:42:35.3107214Z         PASS [   0.073s] ( 722/2580) spt::bin/spt api::startup::tests::session_id_fallback_binds_live_perch_from_sid
2026-08-18T01:42:35.3163592Z         PASS [   0.257s] ( 723/2580) spt-daemon daemon::tests::a_tree_teardown_reaches_a_grandchild_the_service_spawned
2026-08-18T01:42:35.3576308Z         PASS [   0.094s] ( 724/2580) spt-daemon daemon::tests::wmi_create_script_carries_the_no_window_startup_spec
2026-08-18T01:42:35.3742337Z         PASS [   0.146s] ( 725/2580) spt-daemon daemon::tests::spawn_env_additions_reach_the_child_and_keep_the_inherited_environment
2026-08-18T01:42:35.3743525Z         PASS [   0.104s] ( 726/2580) spt-daemon deadline::tests::advance_after_fire_steps_one_grid_normally_and_collapses_a_stall
2026-08-18T01:42:35.4060755Z         PASS [   1.607s] ( 727/2580) spt-daemon autostart::tests::a_persisted_reserved_id_default_is_never_replayed
2026-08-18T01:42:35.4064934Z         PASS [   0.131s] ( 728/2580) spt-daemon deadline::tests::cold_and_crash_write_fresh_anchor_at_now
2026-08-18T01:42:35.4077380Z         PASS [   0.121s] ( 729/2580) spt-daemon deadline::tests::distinct_keys_do_not_cross_clobber
2026-08-18T01:42:35.4178569Z         PASS [   0.121s] ( 730/2580) spt-daemon deadline::tests::next_fire_between_grid_points_rounds_up
2026-08-18T01:42:35.4190923Z         PASS [   0.316s] ( 731/2580) spt-daemon daemon::tests::detached_no_inherit_falls_back_under_a_breakaway_denying_job
2026-08-18T01:42:35.4232510Z         PASS [   0.148s] ( 732/2580) spt-daemon deadline::tests::corrupt_file_degrades_to_fresh
2026-08-18T01:42:35.4236946Z         PASS [   0.107s] ( 733/2580) spt-daemon deadline::tests::next_fire_on_grid_returns_now_and_advances_strictly
2026-08-18T01:42:35.4260730Z         PASS [   0.126s] ( 734/2580) spt-daemon deadline::tests::next_fire_long_jump_collapses_missed_ticks_to_one
2026-08-18T01:42:35.4426310Z         PASS [   0.132s] ( 735/2580) spt::bin/spt api::startup::tests::session_id_fallback_refuses_a_psyche_custody_sid
2026-08-18T01:42:35.4984617Z         PASS [   0.134s] ( 736/2580) spt-daemon deadline::tests::next_fire_saturates_when_now_precedes_anchor
2026-08-18T01:42:35.5138624Z         PASS [   0.141s] ( 737/2580) spt-daemon deadline::tests::one_shot_fires_at_or_after_target_and_never_resets
2026-08-18T01:42:35.5156943Z         PASS [   0.108s] ( 738/2580) spt-daemon deelevate::tests::env_overlay_keeps_explicit_spt_home_alive
2026-08-18T01:42:35.5180196Z         PASS [   0.120s] ( 739/2580) spt-daemon deadline::tests::update_with_no_file_falls_back_fresh
2026-08-18T01:42:35.5189388Z         PASS [   0.116s] ( 740/2580) spt-daemon deadline::tests::zero_interval_degrades_to_config_default
2026-08-18T01:42:35.5262771Z         PASS [   0.153s] ( 741/2580) spt-daemon deadline::tests::update_keeps_anchor_and_refreshes_interval
2026-08-18T01:42:35.5272101Z         PASS [   0.110s] ( 742/2580) spt-daemon deelevate::tests::plan_spawn_deelevates_only_with_a_target
2026-08-18T01:42:35.5281501Z         PASS [   0.110s] ( 743/2580) spt-daemon digest::tests::common_prefix_len_finds_the_unchanged_head
2026-08-18T01:42:35.5329781Z         PASS [   0.444s] ( 744/2580) spt-daemon daemon::tests::breakaway_spawn_escapes_a_kill_on_close_job
2026-08-18T01:42:35.5555208Z         PASS [   0.132s] ( 745/2580) spt-daemon digest::tests::log_less_two_origin_merge_interleaves_by_ts
2026-08-18T01:42:35.5857209Z         PASS [   0.160s] ( 746/2580) spt-daemon digest::tests::merge_by_ts_interleaves_context
2026-08-18T01:42:35.5920215Z         PASS [   0.150s] ( 747/2580) spt::bin/spt api::startup::tests::session_id_fallback_refuses_empty_sid_and_dead_anchor
2026-08-18T01:42:35.6024680Z         PASS [   0.089s] ( 748/2580) spt-daemon digest::tests::projects_empty_for_a_sourceless_endpoint
2026-08-18T01:42:35.6064968Z         PASS [   0.091s] ( 749/2580) spt-daemon digest::tests::resolve_config_precedence
2026-08-18T01:42:35.6116867Z         PASS [   0.095s] ( 750/2580) spt-daemon digest::tests::supersede_collapses_cross_generation_replay_to_newest
2026-08-18T01:42:35.6174256Z         PASS [   0.099s] ( 751/2580) spt-daemon digest::tests::supersede_is_noop_on_disjoint_sessions
2026-08-18T01:42:35.6189425Z         PASS [   0.127s] ( 752/2580) spt-daemon digest::tests::projects_a_log_less_endpoint_from_digest_log
2026-08-18T01:42:35.6217293Z         PASS [   0.096s] ( 753/2580) spt-daemon digest::tests::supersede_keeps_within_generation_repeats
2026-08-18T01:42:35.6261234Z         PASS [   0.099s] ( 754/2580) spt-daemon digest::tests::supersede_trims_divider_around_emptied_middle_generation
2026-08-18T01:42:35.6316263Z         PASS [   0.103s] ( 755/2580) spt-daemon digesthub::tests::dropped_subscriber_is_pruned
2026-08-18T01:42:35.6365254Z         PASS [   0.104s] ( 756/2580) spt-daemon digesthub::tests::project_and_publish_stores_latest
2026-08-18T01:42:35.6411994Z         PASS [   0.086s] ( 757/2580) spt-daemon digesthub::tests::publish_delta_is_tail_then_full_refresh
2026-08-18T01:42:35.6456087Z         PASS [   0.060s] ( 758/2580) spt-daemon digesthub::tests::render_is_glanceable
2026-08-18T01:42:35.6547361Z         PASS [   0.052s] ( 759/2580) spt-daemon digesthub::tests::subscribe_returns_current_base
2026-08-18T01:42:35.6581346Z         PASS [   0.066s] ( 760/2580) spt::bin/spt api::startup::tests::stale_seed_refusal_spends_the_seed_no_restore
2026-08-18T01:42:35.6676072Z         PASS [   0.245s] ( 761/2580) spt-daemon digest::tests::extractor_spans_sessions_with_a_boundary_marker
2026-08-18T01:42:35.7040957Z         PASS [   0.098s] ( 762/2580) spt-daemon dispatch::tests::a_fork_record_is_never_read_as_a_message_and_an_old_daemon_drops_it
2026-08-18T01:42:35.7083153Z         PASS [   0.097s] ( 763/2580) spt-daemon dispatch::tests::a_knock_record_routes_here_and_drops_cleanly_on_an_n1_daemon
2026-08-18T01:42:35.7136171Z         PASS [   0.096s] ( 764/2580) spt-daemon dispatch::tests::a_presence_record_classifies_as_its_own_family_and_never_as_a_message
2026-08-18T01:42:35.7173746Z         PASS [   0.098s] ( 765/2580) spt-daemon dispatch::tests::a_receipt_is_never_read_as_a_message_and_never_as_a_knock
2026-08-18T01:42:35.7227491Z         PASS [   0.101s] ( 766/2580) spt-daemon dispatch::tests::a_redemption_is_dropped_by_an_old_daemon_where_a_knock_field_would_have_been_accepted
2026-08-18T01:42:35.7379032Z         PASS [   0.101s] ( 767/2580) spt-daemon dispatch::tests::breaker_trips_with_doubling_capped_window_and_resets_on_progress
2026-08-18T01:42:35.7429187Z         PASS [   0.102s] ( 768/2580) spt-daemon dispatch::tests::classifies_every_family_by_first_line_shape
2026-08-18T01:42:35.7484105Z         PASS [   0.102s] ( 769/2580) spt-daemon dispatch::tests::classify_failure_seat_blocked_is_exactly_the_three_discipline_strings
2026-08-18T01:42:35.7543848Z         PASS [   0.099s] ( 770/2580) spt-daemon dispatch::tests::cold_enumeration_claims_at_most_the_pool_bound_per_poll
2026-08-18T01:42:35.7645499Z         PASS [   0.097s] ( 771/2580) spt-daemon dispatch::tests::digest_pull_and_rest_never_read_as_each_other
2026-08-18T01:42:35.7680014Z         PASS [   0.110s] ( 772/2580) spt::bin/spt api::startup::tests::stale_seed_with_dead_anchor_refused
2026-08-18T01:42:35.8131897Z         PASS [   0.181s] ( 773/2580) spt-daemon dispatch::tests::an_unadmitted_asker_is_refused_at_this_nodes_own_seam
2026-08-18T01:42:35.8137588Z         PASS [   0.110s] ( 774/2580) spt-daemon dispatch::tests::dispatch_event_carries_the_complete_key_set
2026-08-18T01:42:35.8184854Z         PASS [   0.110s] ( 775/2580) spt-daemon dispatch::tests::each_presence_word_has_exactly_one_authority
2026-08-18T01:42:35.8231987Z         PASS [   0.110s] ( 776/2580) spt-daemon dispatch::tests::feed_accumulator_commits_per_bound_never_per_chunk
2026-08-18T01:42:35.8286934Z         PASS [   0.111s] ( 777/2580) spt-daemon dispatch::tests::finished_is_terminal_for_attach_only
2026-08-18T01:42:35.8333694Z         PASS [   0.111s] ( 778/2580) spt-daemon dispatch::tests::line_endpoint_resolves_each_family_identity_key
2026-08-18T01:42:35.8376524Z         PASS [   0.100s] ( 779/2580) spt-daemon dispatch::tests::oneway_seatblocked_strikes_out_terminal_while_request_reply_paces_forever
2026-08-18T01:42:35.8423551Z         PASS [   0.099s] ( 780/2580) spt-daemon dispatch::tests::only_the_old_broker_unknown_verb_answer_falls_back_to_the_peek
2026-08-18T01:42:35.8470805Z         PASS [   0.099s] ( 781/2580) spt-daemon dispatch::tests::seat_blocked_requeues_budget_free_paced_by_the_breaker_window
2026-08-18T01:42:35.8529722Z         PASS [   0.099s] ( 782/2580) spt-daemon dispatch::tests::the_family_census_is_bijective_with_the_enum
2026-08-18T01:42:35.8567702Z         PASS [   0.092s] ( 783/2580) spt-daemon dispatch::tests::the_family_census_knows_about_the_answer_receipt
2026-08-18T01:42:35.8795445Z         PASS [   0.061s] ( 784/2580) spt-daemon dispatch::tests::transient_failure_requeues_bounded_and_terminal_never_reenters
2026-08-18T01:42:35.8894911Z         PASS [   0.121s] ( 785/2580) spt::bin/spt api::startup::tests::successful_bind_consumes_the_seed_exactly_once
2026-08-18T01:42:35.9322828Z         PASS [   0.306s] ( 786/2580) spt-daemon dispatch::tests::a_served_probe_leaves_the_targets_spool_and_inbox_byte_identical
2026-08-18T01:42:35.9357551Z         PASS [   0.113s] ( 787/2580) spt-daemon dispatch::tests::unknown_shapes_refuse_classification
2026-08-18T01:42:35.9395090Z         PASS [   0.111s] ( 788/2580) spt-daemon docshost::tests::content_types_cover_the_bundle_classes
2026-08-18T01:42:35.9435804Z         PASS [   0.131s] ( 789/2580) spt-daemon dispatch::tests::the_receiver_decides_origin_and_flood_not_the_sender
2026-08-18T01:42:35.9442297Z         PASS [   0.111s] ( 790/2580) spt-daemon docshost::tests::port_resolution_env_config_default
2026-08-18T01:42:35.9486055Z         PASS [   0.111s] ( 791/2580) spt-daemon docshost::tests::sanitizer_admits_pages_and_rejects_escapes
2026-08-18T01:42:35.9528317Z         PASS [   0.110s] ( 792/2580) spt-daemon drivehub::tests::a_following_op_is_served_when_nothing_refused
2026-08-18T01:42:35.9586159Z         PASS [   0.111s] ( 793/2580) spt-daemon drivehub::tests::a_foreign_owlery_is_refused_pre_ack_under_its_own_name
2026-08-18T01:42:35.9636437Z         PASS [   0.111s] ( 794/2580) spt-daemon drivehub::tests::activity_and_drive_never_clobber_each_other
2026-08-18T01:42:35.9680066Z         PASS [   0.111s] ( 795/2580) spt-daemon drivehub::tests::activity_take_is_latest_wins_and_exactly_once
2026-08-18T01:42:35.9727370Z         PASS [   0.093s] ( 796/2580) spt-daemon drivehub::tests::an_unknown_op_hangs_up_instead_of_being_swallowed
2026-08-18T01:42:35.9815590Z         PASS [   0.049s] ( 797/2580) spt-daemon drivehub::tests::clear_evicts_both_classes
2026-08-18T01:42:35.9866438Z         PASS [   0.051s] ( 798/2580) spt-daemon drivehub::tests::clear_evicts_the_slot
2026-08-18T01:42:35.9927031Z         PASS [   0.053s] ( 799/2580) spt-daemon drivehub::tests::dead_generation_activity_frame_is_never_served
2026-08-18T01:42:35.9979740Z         PASS [   0.054s] ( 800/2580) spt-daemon drivehub::tests::dead_generation_frame_is_never_served
2026-08-18T01:42:36.0029673Z         PASS [   0.059s] ( 801/2580) spt-daemon drivehub::tests::drive_result_activity_key_is_additive_on_the_wire
2026-08-18T01:42:36.0080695Z         PASS [   0.059s] ( 802/2580) spt-daemon drivehub::tests::only_a_pre_ack_refusal_permits_a_second_spawn
2026-08-18T01:42:36.0121137Z         PASS [   0.059s] ( 803/2580) spt-daemon drivehub::tests::slots_are_per_owner
2026-08-18T01:42:36.0173449Z         PASS [   0.059s] ( 804/2580) spt-daemon drivehub::tests::take_is_exactly_once
2026-08-18T01:42:36.0221038Z         PASS [   0.058s] ( 805/2580) spt-daemon drivehub::tests::the_launch_reply_shapes_round_trip
2026-08-18T01:42:36.0319675Z         PASS [   0.059s] ( 806/2580) spt-daemon drivehub::tests::write_is_latest_wins
2026-08-18T01:42:36.0506912Z         PASS [   0.064s] ( 807/2580) spt-daemon effect::tests::apply_once_does_not_hold_the_journal_lock_across_effect
2026-08-18T01:42:36.0730047Z         PASS [   0.091s] ( 808/2580) spt-daemon effect::tests::applied_set_survives_reopen
2026-08-18T01:42:36.0910773Z         PASS [   1.895s] ( 809/2580) spt-daemon brainproc::tests::exe_hash_computed_exactly_once_across_n_publishes
2026-08-18T01:42:36.1149007Z         PASS [   0.107s] ( 810/2580) spt-daemon effect::tests::marker_is_single_source_and_frozen
2026-08-18T01:42:36.1200388Z         PASS [   0.108s] ( 811/2580) spt-daemon effect::tests::minter_tag_round_trips
2026-08-18T01:42:36.1265955Z         PASS [   0.109s] ( 812/2580) spt-daemon effect::tests::open_creates_missing_parent_dirs
2026-08-18T01:42:36.1663720Z         PASS [   0.051s] ( 813/2580) spt-daemon effect::tests::with_tracing_retry_no_retry_on_success
2026-08-18T01:42:36.1715412Z         PASS [   0.051s] ( 814/2580) spt-daemon effect::tests::with_tracing_retry_passes_through_other_errors
2026-08-18T01:42:36.1765392Z         PASS [   0.050s] ( 815/2580) spt-daemon effect::tests::with_tracing_retry_retries_once_on_no_longer_held
2026-08-18T01:42:36.1810826Z         PASS [   0.015s] ( 816/2580) spt-daemon effect::tests::with_tracing_retry_terminal_is_public_language
2026-08-18T01:42:36.1859063Z         PASS [   0.014s] ( 817/2580) spt-daemon failedaddr::tests::a_null_address_records_nothing
2026-08-18T01:42:36.1900838Z         PASS [   0.013s] ( 818/2580) spt-daemon failedaddr::tests::a_successful_dial_clears_the_record
2026-08-18T01:42:36.1947284Z         PASS [   0.014s] ( 819/2580) spt-daemon failedaddr::tests::an_expired_record_stops_matching_and_is_swept
2026-08-18T01:42:36.1989607Z         PASS [   0.013s] ( 820/2580) spt-daemon failedaddr::tests::connecting_to_a_peer_clears_only_that_peers_records
2026-08-18T01:42:36.2029997Z         PASS [   0.013s] ( 821/2580) spt-daemon failedaddr::tests::matches_the_exact_address_and_no_other
2026-08-18T01:42:36.2562999Z         PASS [   0.061s] ( 822/2580) spt-daemon firewall::tests::a_deny_line_naming_the_port_does_not_admit_it
2026-08-18T01:42:36.2593315Z         PASS [   0.060s] ( 823/2580) spt-daemon firewall::tests::a_disabled_manager_does_not_shadow_the_backend
2026-08-18T01:42:36.2631405Z         PASS [   0.060s] ( 824/2580) spt-daemon firewall::tests::a_live_manager_outranks_its_backend
2026-08-18T01:42:36.2694713Z         PASS [   0.013s] ( 825/2580) spt-daemon firewall::tests::active_but_unreadable_is_unverified_not_a_verdict
2026-08-18T01:42:36.2738684Z         PASS [   0.014s] ( 826/2580) spt-daemon firewall::tests::active_ufw_is_decided_against_the_bound_port
2026-08-18T01:42:36.2788898Z         PASS [   0.016s] ( 827/2580) spt-daemon firewall::tests::any_rule_of_the_name_admitting_the_binder_passes
2026-08-18T01:42:36.2827938Z         PASS [   0.013s] ( 828/2580) spt-daemon firewall::tests::no_active_firewall_reads_unknown_and_inactive_ones_are_skipped
2026-08-18T01:42:36.2883171Z         PASS [   0.014s] ( 829/2580) spt-daemon firewall::tests::rule_for_another_binary_is_a_mismatch_not_a_pass
2026-08-18T01:42:36.2886789Z         PASS [   0.216s] ( 830/2580) spt-daemon effect::tests::second_apply_for_same_key_is_deduped
2026-08-18T01:42:36.2928714Z         PASS [   0.014s] ( 831/2580) spt-daemon firewall::tests::rule_for_the_binder_passes_regardless_of_case_or_separators
2026-08-18T01:42:36.2982017Z         PASS [   0.015s] ( 832/2580) spt-daemon firewall::tests::unanswerable_probes_read_unknown_and_no_rule_reads_missing
2026-08-18T01:42:36.3031477Z         PASS [   0.015s] ( 833/2580) spt-daemon forkop::tests::forking_into_the_reserved_id_is_refused_before_the_mind_is_copied
2026-08-18T01:42:36.3074680Z         PASS [   0.019s] ( 834/2580) spt-daemon frame::tests::envelope_with_unknown_trailing_field_decodes_on_older_peer
2026-08-18T01:42:36.3281829Z         PASS [   0.278s] ( 835/2580) spt-daemon effect::tests::recover_is_migration_free
2026-08-18T01:42:36.3530911Z         PASS [   0.330s] ( 836/2580) spt-daemon effect::tests::poisoned_journal_lock_still_applies_subsequent_ops
2026-08-18T01:42:36.3535443Z         PASS [   0.385s] ( 837/2580) spt-daemon drivehub::tests::the_pre_ack_causes_are_three_distinct_diagnostics
2026-08-18T01:42:36.3559272Z         PASS [   0.324s] ( 838/2580) spt-daemon effect::tests::ptywrite_skips_the_durable_journal_write_while_netsend_persists
2026-08-18T01:42:36.3561671Z         PASS [   0.265s] ( 839/2580) spt-daemon effect::tests::shellchan_and_rc_same_session_dont_collide
2026-08-18T01:42:36.3568151Z         PASS [   0.359s] ( 840/2580) spt-daemon effect::tests::failed_effect_is_not_recorded_applied
2026-08-18T01:42:36.3661468Z         PASS [   0.073s] ( 841/2580) spt-daemon frame::tests::handshake_accepts_newer_brain_on_older_broker
2026-08-18T01:42:36.3769970Z         PASS [   0.079s] ( 842/2580) spt-daemon frame::tests::handshake_rejects_below_floor
2026-08-18T01:42:36.3816451Z         PASS [   0.078s] ( 843/2580) spt-daemon frame::tests::handshake_rejects_role_mismatch
2026-08-18T01:42:36.3841249Z         PASS [   0.077s] ( 844/2580) spt-daemon frame::tests::unknown_kind_is_not_a_decode_error
2026-08-18T01:42:36.4375291Z         PASS [   0.109s] ( 845/2580) spt-daemon grants::tests::escalation_answers_apply
2026-08-18T01:42:36.4447081Z         PASS [   0.092s] ( 846/2580) spt-daemon grants::tests::escalation_ask_body_roundtrip
2026-08-18T01:42:36.4685059Z         PASS [   0.112s] ( 847/2580) spt-daemon grants::tests::no_session_escalates_with_none_target
2026-08-18T01:42:36.4694882Z         PASS [   0.477s] ( 848/2580) spt-daemon effect::tests::each_named_minter_namespaces_its_ops
2026-08-18T01:42:36.4721206Z         PASS [   0.116s] ( 849/2580) spt-daemon grants::tests::preconsent_flags_author_grants
2026-08-18T01:42:36.4746597Z         PASS [   0.118s] ( 850/2580) spt-daemon grants::tests::reserved_capabilities_refuse_even_when_granted
2026-08-18T01:42:36.4774512Z         PASS [   0.111s] ( 851/2580) spt-daemon grants::tests::ungranted_escalates_granted_allows
2026-08-18T01:42:36.5300322Z         PASS [   0.153s] ( 852/2580) spt-daemon harnesshost::tests::mint_session_id_is_fresh_hex
2026-08-18T01:42:36.5358818Z         PASS [   0.154s] ( 853/2580) spt-daemon harnesshost::tests::node_key_fills_advertised_label_in_session_template
2026-08-18T01:42:36.5381669Z         PASS [   0.535s] ( 854/2580) spt-daemon effect::tests::gauntlet_is_exactly_once_across_brain_crashes
2026-08-18T01:42:36.5411997Z         PASS [   0.157s] ( 855/2580) spt-daemon harnesshost::tests::node_missing_reference_fails_loud
2026-08-18T01:42:36.5465614Z         PASS [   0.109s] ( 856/2580) spt-daemon harnesshost::tests::prepare_fails_closed_on_wrong_kind_missing_role_and_bad_template
2026-08-18T01:42:36.5516008Z         PASS [   0.107s] ( 857/2580) spt-daemon harnesshost::tests::prepare_fills_env_inject_values_with_substitution
2026-08-18T01:42:36.5568631Z         PASS [   0.088s] ( 858/2580) spt-daemon harnesshost::tests::prepare_fills_id_and_session_into_self_command
2026-08-18T01:42:36.5620781Z         PASS [   0.093s] ( 859/2580) spt-daemon harnesshost::tests::prepare_resume_falls_back_to_self_when_no_resume_role
2026-08-18T01:42:36.5668672Z         PASS [   0.095s] ( 860/2580) spt-daemon harnesshost::tests::prepare_selects_resume_template_on_resume_else_self
2026-08-18T01:42:36.5715196Z         PASS [   0.097s] ( 861/2580) spt-daemon harnesshost::tests::prepare_threads_translation_binary_when_declared
2026-08-18T01:42:36.5773144Z         PASS [   0.100s] ( 862/2580) spt-daemon harnesshost::tests::provisional_session_id_recognizes_own_mint_only
2026-08-18T01:42:36.5841066Z         PASS [   0.054s] ( 863/2580) spt-daemon harnesshost::tests::translation_binary_resolves_against_install_dir
2026-08-18T01:42:36.6520783Z         PASS [   0.111s] ( 864/2580) spt-daemon knocknotif::tests::correlation_subnet_beats_first_visible
2026-08-18T01:42:36.6715342Z         PASS [   0.124s] ( 865/2580) spt-daemon knocknotif::tests::courtesy_subnet_is_a_member_subnet
2026-08-18T01:42:36.6778709Z         PASS [   0.126s] ( 866/2580) spt-daemon knocknotif::tests::hidden_addressee_is_not_a_candidate
2026-08-18T01:42:36.8150953Z         PASS [   0.237s] ( 867/2580) spt-daemon lifecycle::tests::base_keys_carries_single_subnet_no_home
2026-08-18T01:42:36.8620832Z         PASS [   0.508s] ( 868/2580) spt-daemon grants::tests::escalation_notif_fires_to_most_recent_and_roundtrips
2026-08-18T01:42:36.8654588Z         PASS [   0.309s] ( 869/2580) spt-daemon lifecycle::tests::a_seeded_ingest_fault_survives_a_turn_success_after_a_restart
2026-08-18T01:42:36.8806058Z         PASS [   0.309s] ( 870/2580) spt-daemon lifecycle::tests::any_kind_success_clears_timeouts_but_only_its_own_hard_counter
2026-08-18T01:42:36.9103898Z         PASS [   0.348s] ( 871/2580) spt-daemon lifecycle::tests::a_slotless_stamp_seeds_nothing_and_an_unknown_slot_is_ignored
2026-08-18T01:42:36.9170615Z         PASS [   0.246s] ( 872/2580) spt-daemon lifecycle::tests::custody_survives_parent_boundary_and_reseed_clears
2026-08-18T01:42:36.9186897Z         PASS [   0.335s] ( 873/2580) spt-daemon lifecycle::tests::crash_signoff_spares_recovered_self
2026-08-18T01:42:36.9430091Z         PASS [   0.291s] ( 874/2580) spt-daemon lifecycle::tests::crash_signoff_tears_down_when_still_gone
2026-08-18T01:42:36.9447420Z         PASS [   0.406s] ( 875/2580) spt-daemon inject::tests::shared_inject_leg_detects_spt_hosted
2026-08-18T01:42:36.9534203Z         PASS [   0.139s] ( 876/2580) spt-daemon lifecycle::tests::echo_fire_skips_loud_on_relative_dir_without_cwd
2026-08-18T01:42:36.9539900Z         PASS [   0.418s] ( 877/2580) spt-daemon inject::tests::has_parked_idle_spool_gates_on_idle_hosted_and_pending
2026-08-18T01:42:36.9906850Z         PASS [   0.125s] ( 878/2580) spt-daemon lifecycle::tests::event_turn_bound_follows_the_role_not_the_pulse
2026-08-18T01:42:36.9946061Z         PASS [   1.181s] ( 879/2580) spt-daemon dispatch::tests::the_relay_observation_is_a_real_connect_and_a_gone_listener_never_reads_offline
2026-08-18T01:42:37.0379538Z         PASS [   0.157s] ( 880/2580) spt-daemon lifecycle::tests::first_turn_psyche_context_is_never_empty
2026-08-18T01:42:37.0812014Z         PASS [   0.403s] ( 881/2580) spt-daemon lifecycle::tests::echo_fire_resolves_relative_commune_dir_against_endpoint_cwd
2026-08-18T01:42:37.0946755Z         PASS [   0.184s] ( 882/2580) spt-daemon lifecycle::tests::harness_owner_gone_anchors_on_parent_pid
2026-08-18T01:42:37.1086339Z         PASS [   0.190s] ( 883/2580) spt-daemon lifecycle::tests::is_owlery_internal_cases
2026-08-18T01:42:37.1087491Z         PASS [   1.219s] ( 884/2580) spt::bin/spt api::startup::tests::the_escape_the_refusal_names_actually_clears_it
2026-08-18T01:42:37.1210439Z         PASS [   0.178s] ( 885/2580) spt-daemon lifecycle::tests::manifest_cell_refresh_swaps_manifest_and_runtime
2026-08-18T01:42:37.1253607Z         PASS [   0.180s] ( 886/2580) spt-daemon lifecycle::tests::node_key_fills_advertised_label_in_lifecycle_base_keys
2026-08-18T01:42:37.1359278Z         PASS [   0.146s] ( 887/2580) spt-daemon lifecycle::tests::outcome_classifies_by_type_never_by_message
2026-08-18T01:42:37.1408741Z         PASS [   0.146s] ( 888/2580) spt-daemon lifecycle::tests::outcome_names_its_leg_and_turn_failure_wins
2026-08-18T01:42:37.1517606Z         PASS [   0.070s] ( 889/2580) spt-daemon lifecycle::tests::psyche_turn_keys_carry_custody_sids_and_context_file_path
2026-08-18T01:42:37.1569600Z         PASS [   0.203s] ( 890/2580) spt-daemon lifecycle::tests::orphan_watch_honors_stop_for_live_owner
2026-08-18T01:42:37.1570319Z         PASS [   0.063s] ( 891/2580) spt-daemon lifecycle::tests::psyche_turn_strikes_exhausted_boundary
2026-08-18T01:42:37.1584200Z         PASS [   0.121s] ( 892/2580) spt-daemon lifecycle::tests::psyche_context_file_continue_is_zero_bytes_fresh_is_nonempty
2026-08-18T01:42:37.1589321Z         PASS [   0.242s] ( 893/2580) spt-daemon lifecycle::tests::ingest_hard_failures_stamp_even_while_turns_succeed
2026-08-18T01:42:37.2140470Z         PASS [   0.105s] ( 894/2580) spt::bin/spt api::startup::tests::the_pid_role_is_stamped_from_the_entry_path
2026-08-18T01:42:37.2528958Z         PASS [   0.132s] ( 895/2580) spt-daemon lifecycle::tests::pulse_loop_does_not_write_anchor_per_fire
2026-08-18T01:42:37.2612005Z         PASS [   0.136s] ( 896/2580) spt-daemon lifecycle::tests::pulse_loop_is_config_paced_and_killable
2026-08-18T01:42:37.2725312Z         PASS [   0.115s] ( 897/2580) spt-daemon lifecycle::tests::reload_fires_on_disk_change
2026-08-18T01:42:37.2848867Z         PASS [   0.126s] ( 898/2580) spt-daemon lifecycle::tests::reload_keeps_last_good_on_unparseable
2026-08-18T01:42:37.3018068Z         PASS [   0.166s] ( 899/2580) spt-daemon lifecycle::tests::pulse_loop_update_preserves_phase_crash_rebases
2026-08-18T01:42:37.3018932Z         PASS [   0.193s] ( 900/2580) spt-daemon lifecycle::tests::psyche_turn_threads_parent_read_env_into_spawn
2026-08-18T01:42:37.3233029Z         PASS [   0.178s] ( 901/2580) spt-daemon lifecycle::tests::pulse_recency_and_auto_suspend_follow_resting_state
2026-08-18T01:42:37.3281233Z         PASS [   0.374s] ( 902/2580) spt-daemon lifecycle::tests::orphan_watch_fires_on_dead_owner
2026-08-18T01:42:37.3349820Z         PASS [   0.176s] ( 903/2580) spt-daemon lifecycle::tests::reload_noop_when_unchanged
2026-08-18T01:42:37.3735765Z         PASS [   0.121s] ( 904/2580) spt-daemon lifecycle::tests::reload_noop_without_install_dir
2026-08-18T01:42:37.3788826Z         PASS [   0.118s] ( 905/2580) spt-daemon lifecycle::tests::resolve_endpoint_drop_dir_cases
2026-08-18T01:42:37.4159039Z         PASS [   0.202s] ( 906/2580) spt::bin/spt api::startup::tests::valid_seed_binds_live_perch
2026-08-18T01:42:37.4512161Z         PASS [   0.149s] ( 907/2580) spt-daemon lifecycle::tests::session_not_found_discriminates_reseed_from_strike
2026-08-18T01:42:37.5436787Z         PASS [   0.271s] ( 908/2580) spt-daemon lifecycle::tests::rest_edge_echo_success_clears_stale_psyche_stamp
2026-08-18T01:42:37.5981161Z         PASS [   0.279s] ( 909/2580) spt-daemon lifecycle::tests::the_expectation_is_recorded_before_the_spawn_not_after
2026-08-18T01:42:37.6492332Z         PASS [   0.198s] ( 910/2580) spt-daemon linkhost::tests::force_on_an_offline_instance_is_the_plain_relink
2026-08-18T01:42:37.6741670Z         PASS [   0.300s] ( 911/2580) spt-daemon lifecycle::tests::turn_budget_stamps_on_exhaustion_and_clears_on_success
2026-08-18T01:42:37.6742362Z         PASS [   0.131s] ( 912/2580) spt-daemon linkhost::tests::force_refuses_an_ephemeral_instance_and_moves_nothing
2026-08-18T01:42:37.7108780Z         PASS [   0.376s] ( 913/2580) spt-daemon lifecycle::tests::timeout_budget_is_ten_deep_not_three
2026-08-18T01:42:37.7686544Z         PASS [   0.441s] ( 914/2580) spt-daemon lifecycle::tests::thrash_budget_trips_on_a_synthetic_failure_loop_without_touching_status
2026-08-18T01:42:37.7863623Z         PASS [   0.137s] ( 915/2580) spt-daemon linkhost::tests::per_capability_act_gate_blocks_until_class_scoped_grant
2026-08-18T01:42:37.9223215Z         PASS [   0.543s] ( 916/2580) spt-daemon linkhost::tests::cmd_wakes_a_stale_online_persistent_instance
2026-08-18T01:42:38.0513017Z         PASS [   0.766s] ( 917/2580) spt-daemon lifecycle::tests::rest_event_fires_echo_once_and_wake_resurfaces
2026-08-18T01:42:38.0804489Z         PASS [   0.482s] ( 918/2580) spt-daemon linkhost::tests::gateway_typed_owner_resolves_and_drives_keyed_on_id_not_type
2026-08-18T01:42:38.0949691Z         PASS [   0.326s] ( 919/2580) spt-daemon linkhost::tests::run_action_honors_the_force_arg
2026-08-18T01:42:38.1265534Z         PASS [   0.416s] ( 920/2580) spt-daemon linkhost::tests::run_action_drive_drops_offline_without_wake_or_spool
2026-08-18T01:42:38.2021258Z         PASS [   0.528s] ( 921/2580) spt-daemon linkhost::tests::prepare_drive_is_live_or_drop_and_never_spools
2026-08-18T01:42:38.2832215Z         PASS [   0.608s] ( 922/2580) spt-daemon linkhost::tests::relink_refuses_a_live_instance_but_recovers_a_stale_online_one
2026-08-18T01:42:38.3006494Z         PASS [   0.514s] ( 923/2580) spt-daemon linkhost::tests::run_action_refuses_gated_op_without_spooling
2026-08-18T01:42:38.3177812Z         PASS [   1.016s] ( 924/2580) spt-daemon lifecycle::tests::role_less_manifest_ticks_strike_free
2026-08-18T01:42:38.3242750Z         PASS [   0.273s] ( 925/2580) spt-daemon linkhost::tests::survivor_probe_separates_our_binary_from_a_recycled_pid
2026-08-18T01:42:38.3900856Z         PASS [   0.310s] ( 926/2580) spt-daemon machineid::tests::hash_is_domain_separated_and_stable
2026-08-18T01:42:38.4434611Z         PASS [   0.348s] ( 927/2580) spt-daemon machineid::tests::machine_id_hash_resolves_and_is_stable
2026-08-18T01:42:38.5022403Z         PASS [   0.580s] ( 928/2580) spt-daemon linkhost::tests::run_action_relinks_drives_and_refuses
2026-08-18T01:42:38.5023027Z         PASS [   0.376s] ( 929/2580) spt-daemon msg::tests::bytes_round_trip_through_payload
2026-08-18T01:42:38.6074148Z         PASS [   0.405s] ( 930/2580) spt-daemon msg::tests::endpoint_injected_envelope_carries_delivered_and_spool_hint
2026-08-18T01:42:38.6156510Z         PASS [   0.333s] ( 931/2580) spt-daemon msg::tests::endpoint_input_frames_round_trip
2026-08-18T01:42:38.7130798Z         PASS [   0.412s] ( 932/2580) spt-daemon msg::tests::evicted_envelope_round_trips
2026-08-18T01:42:38.7676555Z         PASS [   0.449s] ( 933/2580) spt-daemon msg::tests::input_req_absent_ack_defaults_true_n_minus_1_safe
2026-08-18T01:42:38.8236731Z         PASS [   0.499s] ( 934/2580) spt-daemon msg::tests::input_req_ack_false_round_trips_faithfully
2026-08-18T01:42:38.8820264Z         PASS [   0.492s] ( 935/2580) spt-daemon msg::tests::net_frames_round_trip_and_tolerate_unknown_fields
2026-08-18T01:42:38.8855776Z         PASS [   0.442s] ( 936/2580) spt-daemon msg::tests::output_envelope_round_trips
2026-08-18T01:42:38.9445522Z         PASS [   0.442s] ( 937/2580) spt-daemon msg::tests::output_sync_flag_defaults_absent_and_skips_when_false
2026-08-18T01:42:38.9479712Z         PASS [   0.446s] ( 938/2580) spt-daemon msg::tests::presence_event_round_trips_and_tolerates_future_kind
2026-08-18T01:42:39.0031353Z         PASS [   0.396s] ( 939/2580) spt-daemon msg::tests::spawn_req_tolerates_unknown_field
2026-08-18T01:42:39.0129697Z         PASS [   0.397s] ( 940/2580) spt-daemon msg::tests::stream_lifetime_is_additive_and_defaults_durable
2026-08-18T01:42:39.0179486Z         PASS [   0.305s] ( 941/2580) spt-daemon msg::tests::two_phase_join_wire_round_trips
2026-08-18T01:42:39.0221272Z         PASS [   0.255s] ( 942/2580) spt-daemon msg::tests::wire_decodes_old_shape_to_legacy
2026-08-18T01:42:39.0808627Z         PASS [   0.198s] ( 943/2580) spt-daemon nethost::tests::attach_replay_never_interleaves_with_concurrent_live_appends
2026-08-18T01:42:39.0817315Z         PASS [   0.258s] ( 944/2580) spt-daemon nethost::tests::append_halts_at_first_failed_write_removes_the_seat_and_cancels_the_lease
2026-08-18T01:42:39.1345440Z         PASS [   0.248s] ( 945/2580) spt-daemon nethost::tests::begin_attach_refuses_only_while_a_poisoned_prior_still_drains
2026-08-18T01:42:39.2443461Z         PASS [   0.226s] ( 946/2580) spt-daemon nethost::tests::finish_halts_and_removes_a_poisoned_seat
2026-08-18T01:42:39.2450663Z         PASS [   0.232s] ( 947/2580) spt-daemon nethost::tests::displaced_writer_failure_never_cancels_the_successor_lease
2026-08-18T01:42:39.2495964Z         PASS [   0.227s] ( 948/2580) spt-daemon nethost::tests::home_relay_reads_a_real_serialized_endpoint_addr
2026-08-18T01:42:39.2882600Z         PASS [   0.285s] ( 949/2580) spt-daemon nethost::tests::dispatch_stream_infos_excludes_local_and_retired_rows_server_side
2026-08-18T01:42:39.3488756Z         PASS [   0.404s] ( 950/2580) spt-daemon nethost::tests::bounded_block_on_cuts_a_never_completing_op_with_an_ordinary_error
2026-08-18T01:42:39.3523418Z         PASS [   0.272s] ( 951/2580) spt-daemon nethost::tests::host_binds_endpoint_to_node_identity
2026-08-18T01:42:39.3606077Z         PASS [   1.942s] ( 952/2580) spt::bin/spt rc::tests::attach_viewport_reconnects_across_a_broker_bounce
2026-08-18T01:42:39.3789064Z         PASS [   0.297s] ( 953/2580) spt-daemon nethost::tests::loopback_conn_is_a_reused_singleton_that_cross_wires_a_stream_pair
2026-08-18T01:42:39.3789913Z         PASS [   0.135s] ( 954/2580) spt-daemon nethost::tests::next_seq_counts_appends_not_logical_chunks
2026-08-18T01:42:39.4104899Z         PASS [   2.843s] ( 955/2580) spt-daemon lifecycle::tests::an_ingest_consumes_the_standing_expectation
2026-08-18T01:42:39.5101825Z         PASS [   0.220s] ( 956/2580) spt-daemon nethost::tests::opener_capture_gives_up_bounded_on_a_newline_less_stream
2026-08-18T01:42:39.5156231Z         PASS [   0.166s] ( 957/2580) spt-daemon nethost::tests::opener_pins_first_line_across_full_ring_roll
2026-08-18T01:42:39.5190843Z         PASS [   0.274s] ( 958/2580) spt-daemon nethost::tests::op_maps_are_minter_namespaced
2026-08-18T01:42:39.5191599Z         PASS [   0.269s] ( 959/2580) spt-daemon nethost::tests::open_class_routes_to_the_opener_row_only
2026-08-18T01:42:39.5232635Z         PASS [   0.575s] ( 960/2580) spt-daemon nethost::tests::conn_close_sweeps_its_stream_rows
2026-08-18T01:42:39.5724135Z         PASS [   0.214s] ( 961/2580) spt::bin/spt rc::tests::broker_host_child
2026-08-18T01:42:39.5761972Z         PASS [   0.222s] ( 962/2580) spt-daemon nethost::tests::overflow_detaches_without_lease_cancel_and_the_brain_resumes_from_cursor
2026-08-18T01:42:39.5896562Z         PASS [   0.208s] ( 963/2580) spt-daemon nethost::tests::presence_log_mirrors_the_seat_discipline
2026-08-18T01:42:39.5993634Z         PASS [   0.220s] ( 964/2580) spt-daemon nethost::tests::retentive_log_is_lossless_ordered_while_ordinary_log_overwrites
2026-08-18T01:42:39.7043988Z         PASS [   0.293s] ( 965/2580) spt-daemon nethost::tests::retire_hides_the_row_while_active_rows_stay
2026-08-18T01:42:39.7045125Z         PASS [   0.196s] ( 966/2580) spt-daemon nethost::tests::retire_sweep_dismisses_the_seat_and_terminal_retire_drops_the_row
2026-08-18T01:42:39.7416442Z         PASS [   2.873s] ( 967/2580) spt-daemon lifecycle::tests::empty_sweep_yields_no_outcome_while_a_real_ingest_yields_success
2026-08-18T01:42:39.7988029Z         PASS [   0.283s] ( 968/2580) spt-daemon nethost::tests::retired_row_still_flushes_a_late_reply
2026-08-18T01:42:39.7988907Z         PASS [   0.279s] ( 969/2580) spt-daemon nethost::tests::send_stream_refuses_on_a_canceled_lease
2026-08-18T01:42:39.8257639Z         PASS [   0.302s] ( 970/2580) spt-daemon nethost::tests::unsubscribe_releases_only_the_callers_seat_joins_writer_and_is_idempotent
2026-08-18T01:42:39.8509022Z         PASS [   0.332s] ( 971/2580) spt-daemon nethost::tests::two_hosts_dial_over_loopback
2026-08-18T01:42:40.1075565Z         PASS [   2.956s] ( 972/2580) spt-daemon lifecycle::tests::pulse_tick_ingests_drop
2026-08-18T01:42:40.2924121Z         PASS [   0.705s] ( 973/2580) spt-daemon notif::tests::an_absent_addressee_yields_no_target_rather_than_the_mra_winner
2026-08-18T01:42:40.4188230Z         PASS [   1.285s] ( 974/2580) spt-daemon nethost::tests::loopback_tunnel_backpressures_without_loss
2026-08-18T01:42:40.4346244Z         PASS [   0.699s] ( 975/2580) spt-daemon notif::tests::first_fire_declines_an_already_expired_row
2026-08-18T01:42:40.4348334Z         PASS [   0.730s] ( 976/2580) spt-daemon notif::tests::expired_row_is_auto_dismissed_at_boundary_not_surfaced
2026-08-18T01:42:40.4704148Z         PASS [   0.766s] ( 977/2580) spt-daemon notif::tests::consent_decision_produces_notif_only_when_gated
2026-08-18T01:42:40.5987705Z         PASS [   0.164s] ( 978/2580) spt-daemon notif::tests::notif_command_renders_all_keys_and_is_opt_in
2026-08-18T01:42:40.6120699Z         PASS [   1.037s] ( 979/2580) spt-daemon notif::tests::a_boundary_surfaces_an_addressed_row_only_at_its_addressee
2026-08-18T01:42:40.6142133Z         PASS [   0.763s] ( 980/2580) spt-daemon notif::tests::hidden_endpoint_boundary_surfaces_nothing
2026-08-18T01:42:40.6154055Z         PASS [   0.323s] ( 981/2580) spt-daemon notif::tests::no_live_endpoint_is_a_typed_no_target
2026-08-18T01:42:40.6155934Z         PASS [   0.817s] ( 982/2580) spt-daemon notif::tests::first_fire_redirects_to_a_fresher_remote_winner_unmarked
2026-08-18T01:42:40.6403660Z         PASS [   0.814s] ( 983/2580) spt-daemon notif::tests::first_fire_rides_the_quiet_window_not_the_live_stream
2026-08-18T01:42:40.6976710Z         PASS [   0.897s] ( 984/2580) spt-daemon notif::tests::first_fire_reaches_most_recent_visible_endpoint
2026-08-18T01:42:40.7163277Z         PASS [   0.102s] ( 985/2580) spt-daemon notifgate::tests::an_unvalidatable_notify_passes
2026-08-18T01:42:40.7350000Z         PASS [   0.627s] ( 986/2580) spt-daemon notif::tests::hidden_endpoint_is_never_the_target
2026-08-18T01:42:40.7381189Z         PASS [   0.123s] ( 987/2580) spt-daemon notifgate::tests::distinct_notifs_both_deliver
2026-08-18T01:42:40.7391377Z         PASS [   0.124s] ( 988/2580) spt-daemon notifgate::tests::retain_preserves_order_of_the_survivors
2026-08-18T01:42:40.7904808Z         PASS [   0.151s] ( 989/2580) spt-daemon notifgate::tests::the_validity_gate_decision_table
2026-08-18T01:42:40.8290113Z         PASS [   0.230s] ( 990/2580) spt-daemon notif::tests::shell_notif_templates_render_for_attached_instances_only
2026-08-18T01:42:40.8603785Z         PASS [   1.260s] ( 991/2580) spt-daemon notif::tests::an_addressed_row_fires_at_its_addressee_and_nowhere_else
2026-08-18T01:42:40.8945596Z         PASS [   0.476s] ( 992/2580) spt-daemon notif::tests::node_scoped_first_fire_ignores_a_fresher_remote_winner
2026-08-18T01:42:40.9308405Z         PASS [   0.139s] ( 993/2580) spt-daemon pairhost::tests::a_re_postured_subnet_advises_and_never_applies
2026-08-18T01:42:41.0101966Z         PASS [   0.148s] ( 994/2580) spt-daemon pairhost::tests::joiner_clock_render_shows_step_offset_and_state
2026-08-18T01:42:41.0158270Z         PASS [   0.121s] ( 995/2580) spt-daemon pairhost::tests::meet_failure_detail_concise_vs_verbose
2026-08-18T01:42:41.0286263Z         PASS [   0.099s] ( 996/2580) spt-daemon pairhost::tests::meet_final_retry_failing_surrenders_once
2026-08-18T01:42:41.0657508Z         PASS [   0.057s] ( 997/2580) spt-daemon pairhost::tests::meet_retries_once_after_refresh_on_exhaustion
2026-08-18T01:42:41.1268488Z         PASS [   0.431s] ( 998/2580) spt-daemon notifsync::tests::concurrent_dismiss_and_surface_commute_across_the_feed
2026-08-18T01:42:41.1323260Z         PASS [   0.116s] ( 999/2580) spt-daemon pairhost::tests::the_advisory_says_nothing_was_applied
2026-08-18T01:42:41.1368073Z         PASS [   0.108s] (1000/2580) spt-daemon pairhost::tests::wire_errors_classify_for_the_guided_ux
2026-08-18T01:42:41.1641329Z         PASS [   0.336s] (1001/2580) spt-daemon pairhost::tests::an_advisory_records_the_sighting_and_still_applies_nothing
2026-08-18T01:42:41.1922116Z         PASS [   0.457s] (1002/2580) spt-daemon notifsync::tests::node_scoped_rows_are_excluded_from_the_feed
2026-08-18T01:42:41.1952420Z         PASS [   0.454s] (1003/2580) spt-daemon notifsync::tests::non_member_subnet_record_never_materializes
2026-08-18T01:42:41.1953287Z         PASS [   0.127s] (1004/2580) spt-daemon presence::tests::mra_degrades_to_local_and_skips_noise_rows
2026-08-18T01:42:41.2140076Z         PASS [   0.498s] (1005/2580) spt-daemon notifsync::tests::feed_converges_two_stores_and_dismiss_replicates
2026-08-18T01:42:41.2499019Z         PASS [   0.511s] (1006/2580) spt-daemon notifsync::tests::untrusted_and_cross_subnet_origins_are_dropped
2026-08-18T01:42:41.2592255Z         PASS [   0.127s] (1007/2580) spt-daemon presence::tests::snapshot_loading_degrades_on_junk
2026-08-18T01:42:41.2592870Z         PASS [   0.789s] (1008/2580) spt-daemon notif::tests::rollback_notif_is_loud_and_resurfaces
2026-08-18T01:42:41.2863915Z         PASS [   0.672s] (1009/2580) spt-daemon notif::tests::suppression_window_holds_cross_endpoint
2026-08-18T01:42:41.3045338Z         PASS [   0.869s] (1010/2580) spt-daemon notif::tests::resurface_delivers_undismissed_with_gates
2026-08-18T01:42:41.3046063Z         PASS [   0.178s] (1011/2580) spt-daemon presence::tests::mra_joins_local_and_gossiped_legs_under_one_max
2026-08-18T01:42:41.3272840Z         PASS [   0.191s] (1012/2580) spt-daemon presence::tests::subnet_scope_gates_both_legs
2026-08-18T01:42:41.3393241Z         PASS [   0.146s] (1013/2580) spt-daemon projwriter::tests::cold_construct_spawns_no_git_and_first_cycle_publishes
2026-08-18T01:42:41.3444253Z         PASS [   0.152s] (1014/2580) spt-daemon projwriter::tests::corrupt_index_is_repaired_and_counted
2026-08-18T01:42:41.5533259Z         PASS [   0.249s] (1015/2580) spt-daemon propagate::tests::classifier_maps_every_status_shape
2026-08-18T01:42:41.5599075Z         PASS [  12.042s] (1016/2580) spt::bin/spt cli::tests::shell_spawn_gates_on_the_registered_set
2026-08-18T01:42:41.7119943Z         PASS [   2.140s] (1017/2580) spt::bin/spt rc::tests::qualified_targets_attach_with_bare_wire_id
2026-08-18T01:42:42.7246594Z         PASS [   1.012s] (1018/2580) spt::bin/spt rc::tests::reconnect_class_only_severed_transport_redrives
2026-08-18T01:42:42.7597281Z         PASS [   0.034s] (1019/2580) spt::bin/spt wansend::tests::a_knock_reports_only_what_the_far_end_confirmed
2026-08-18T01:42:42.7994809Z         PASS [   0.041s] (1020/2580) spt::bin/spt wansend::tests::a_shared_short_key_refuses_and_an_unknown_one_is_its_own_outcome
2026-08-18T01:42:42.8656350Z         PASS [   0.066s] (1021/2580) spt::bin/spt wansend::tests::a_short_key_resolves_through_each_node_tier_carrier_alone
2026-08-18T01:42:42.8893846Z         PASS [   0.024s] (1022/2580) spt::bin/spt wansend::tests::an_explicit_override_outranks_the_ownership_scope
2026-08-18T01:42:42.9602285Z         PASS [   0.070s] (1023/2580) spt::bin/spt wansend::tests::an_unanswered_fork_is_unconfirmed_and_never_reported_as_done
2026-08-18T01:42:42.9785903Z         PASS [   1.782s] (1024/2580) spt-daemon projwriter::tests::cwd_invalidation_evicts_shared_cache_entry
2026-08-18T01:42:43.0469933Z         PASS [   0.087s] (1025/2580) spt::bin/spt wansend::tests::bare_id_resolves_across_remote_snapshot
2026-08-18T01:42:43.1164220Z         PASS [   0.068s] (1026/2580) spt::bin/spt wansend::tests::classify_wan_reply_only_delivers_on_positive_outcomes
2026-08-18T01:42:43.1498389Z         PASS [   0.035s] (1027/2580) spt::bin/spt wansend::tests::hide_new_reaches_this_nodes_ids_and_no_further
2026-08-18T01:42:43.1883185Z         PASS [   0.038s] (1028/2580) spt::bin/spt wansend::tests::load_snapshots_degrades_on_junk
2026-08-18T01:42:43.3348855Z         PASS [   1.774s] (1029/2580) spt-daemon psyrelay::tests::prose_only_relays_nothing
2026-08-18T01:42:43.3669790Z         PASS [   1.814s] (1030/2580) spt-daemon psyrelay::tests::null_stdout_driver_fails_the_guard
2026-08-18T01:42:43.3832767Z         PASS [   2.038s] (1031/2580) spt-daemon psyrelay::tests::notify_without_live_endpoint_is_pending
2026-08-18T01:42:43.4225992Z         PASS [   0.235s] (1032/2580) spt::bin/spt wansend::tests::refusals_render_copy_paste_targets
2026-08-18T01:42:43.4331959Z         PASS [   2.106s] (1033/2580) spt-daemon psyrelay::tests::empty_and_oversize_bodies_drop_typed
2026-08-18T01:42:43.4719554Z         PASS [   2.133s] (1034/2580) spt-daemon psyrelay::tests::notify_reaches_own_user_only
2026-08-18T01:42:43.4952035Z         PASS [   0.112s] (1035/2580) spt-daemon pump::health::tests::a_failing_peer_whose_node_the_registry_reports_offline_reads_absent_not_degraded
2026-08-18T01:42:43.5132022Z         PASS [   0.079s] (1036/2580) spt-daemon pump::health::tests::a_non_target_connection_never_counts_and_disconnects_mirror_the_conn_set
2026-08-18T01:42:43.5154581Z         PASS [   0.043s] (1037/2580) spt-daemon pump::health::tests::a_subnet_leave_re_derives_the_live_count_without_disconnecting_anybody
2026-08-18T01:42:43.5190204Z         PASS [   0.022s] (1038/2580) spt-daemon pump::health::tests::a_target_leaving_the_roster_drops_its_failure_and_can_return_the_node_to_green
2026-08-18T01:42:43.5446636Z         PASS [   0.032s] (1039/2580) spt-daemon pump::health::tests::degraded_on_all_peer_failure_healthy_only_on_real_progress
2026-08-18T01:42:43.5533631Z         PASS [   0.038s] (1040/2580) spt-daemon pump::health::tests::five_of_seven_failing_behind_two_live_peers_is_degraded_partial_never_healthy
2026-08-18T01:42:43.5666212Z         PASS [   0.592s] (1041/2580) spt-daemon psyrelay::tests::reply_relays_to_inbound_sender
2026-08-18T01:42:43.5734321Z         PASS [   0.055s] (1042/2580) spt-daemon pump::health::tests::health_file_roundtrip_and_degrade
2026-08-18T01:42:43.6159573Z         PASS [   0.071s] (1043/2580) spt-daemon pump::health::tests::one_peer_reconnecting_narrows_the_verdict_without_restarting_the_incident_clock
2026-08-18T01:42:43.6192090Z         PASS [   0.066s] (1044/2580) spt-daemon pump::health::tests::one_unaccounted_failing_peer_holds_the_degraded_partial_verdict
2026-08-18T01:42:43.6296076Z         PASS [   0.062s] (1045/2580) spt-daemon pump::health::tests::peers_absent_replaces_only_a_degraded_verdict_and_never_outlives_its_target
2026-08-18T01:42:43.6504509Z         PASS [   0.078s] (1046/2580) spt-daemon pump::health::tests::registry_admit_stamp_survives_restart_rounds_and_never_regresses
2026-08-18T01:42:43.6931514Z         PASS [   0.077s] (1047/2580) spt-daemon pump::health::tests::stage_parses_from_attributed_reasons
2026-08-18T01:42:43.7046430Z         PASS [   0.085s] (1048/2580) spt-daemon pump::health::tests::stale_gossip_forces_the_conservative_read_even_with_every_node_offline
2026-08-18T01:42:43.7191141Z         PASS [   0.089s] (1049/2580) spt-daemon pump::registry::tests::disclosable_lines_keeps_the_per_subnet_filter
2026-08-18T01:42:43.7820670Z         FAIL [   0.084s] (1050/2580) spt-daemon pump::registry::tests::discover_gate_filters_the_advert_push_per_viewer
2026-08-18T01:42:43.7821399Z   stdout ───
2026-08-18T01:42:43.7821509Z 
2026-08-18T01:42:43.7821590Z     running 1 test
2026-08-18T01:42:43.7822253Z     test pump::registry::tests::discover_gate_filters_the_advert_push_per_viewer ... FAILED
2026-08-18T01:42:43.7822625Z 
2026-08-18T01:42:43.7822700Z     failures:
2026-08-18T01:42:43.7822804Z 
2026-08-18T01:42:43.7822881Z     failures:
2026-08-18T01:42:43.7823185Z         pump::registry::tests::discover_gate_filters_the_advert_push_per_viewer
2026-08-18T01:42:43.7823487Z 
2026-08-18T01:42:43.7823772Z     test result: FAILED. 0 passed; 1 failed; 0 ignored; 0 measured; 843 filtered out; finished in 0.05s
2026-08-18T01:42:43.7824196Z 
2026-08-18T01:42:43.7824309Z   stderr ───
2026-08-18T01:42:43.7824410Z 
2026-08-18T01:42:43.7824915Z     thread 'pump::registry::tests::discover_gate_filters_the_advert_push_per_viewer' (35664) panicked at crates\spt-daemon\src\pump\registry.rs:369:13:
2026-08-18T01:42:43.7826073Z     refused viewer is not told the endpoint exists: {"subnet":"home","endpoint_id":"ling","instance":{"node":"me","status":"Active","epoch":1,"resources":"ling builds rust","bound":true}}
2026-08-18T01:42:43.7827119Z     {"subnet":"home","endpoint_id":"doyle","instance":{"node":"me","status":"Active","epoch":1,"resources":"doyle builds rust","bound":true}}
2026-08-18T01:42:43.7827752Z     {"subnet":"home","node":"me","label":"hfenduleam","epoch":1}
2026-08-18T01:42:43.7828012Z 
2026-08-18T01:42:43.7828225Z     note: run with `RUST_BACKTRACE=1` environment variable to display a backtrace
2026-08-18T01:42:43.7828561Z 
2026-08-18T01:42:43.7828893Z   Cancelling due to test failure: 15 tests still running
2026-08-18T01:42:43.7965331Z         PASS [   2.537s] (1051/2580) spt-daemon projwriter::tests::ordinary_commit_is_noop_config_change_rederives
2026-08-18T01:42:43.8003509Z         PASS [   0.146s] (1052/2580) spt-daemon pump::registry::tests::disclosable_lines_pushes_the_engine_room_only_to_its_chosen_viewer
2026-08-18T01:42:43.8018796Z         PASS [   0.083s] (1053/2580) spt-daemon pump::registry::tests::poll_wake_takes_the_advertise_marker_exactly_once
2026-08-18T01:42:43.9327756Z         PASS [   0.585s] (1054/2580) spt-daemon psyrelay::tests::reply_without_target_is_dropped
2026-08-18T01:42:43.9330071Z         PASS [   6.765s] (1055/2580) spt-daemon lifecycle::tests::relative_commune_dir_resolves_against_endpoint_cwd_and_fills_project_branch
2026-08-18T01:42:43.9387231Z         PASS [   0.234s] (1056/2580) spt-daemon pump::registry::tests::fire_due_rotations_rotates_due_and_leaves_pending
2026-08-18T01:42:43.9499229Z         PASS [   2.646s] (1057/2580) spt-daemon projwriter::tests::writer_thread_debounces_burst_into_one_cycle
2026-08-18T01:42:44.1482629Z         PASS [   0.781s] (1058/2580) spt-daemon psyrelay::tests::spoofed_routing_is_stripped_and_restamped
2026-08-18T01:42:44.2381370Z         PASS [   0.815s] (1059/2580) spt::bin/spt wansend::tests::remote_rest_suspends_and_wakes_with_the_deferred_gate
2026-08-18T01:42:44.6509511Z         PASS [   3.401s] (1060/2580) spt-daemon projwriter::tests::failed_cycle_preserves_last_known_good
2026-08-18T01:42:44.6839708Z         PASS [   3.400s] (1061/2580) spt-daemon projwriter::tests::warm_start_unchanged_generation_scans_nothing
2026-08-18T01:42:44.6938749Z         PASS [   3.480s] (1062/2580) spt-daemon projwriter::tests::endpoint_events_patch_rows_and_drop_purged
2026-08-18T01:42:46.1601611Z         PASS [   4.996s] (1063/2580) spt-daemon projwriter::tests::batched_complexity_counters_hold
2026-08-18T01:42:46.3015862Z         PASS [  18.239s] (1064/2580) spt::bin/spt cli::tests::owner_shutdown_gated_by_can_shutdown_grant
2026-08-18T01:42:46.9976588Z         PASS [   5.738s] (1065/2580) spt-daemon projwriter::tests::parity_full_ordered_list_vs_legacy_oracle
2026-08-18T01:42:46.9981161Z ────────────
2026-08-18T01:42:46.9981675Z      Summary [  22.416s] 1065/2580 tests run: 1064 passed (4 leaky), 1 failed, 1 skipped
2026-08-18T01:42:46.9982934Z         FAIL [   0.084s] (1050/2580) spt-daemon pump::registry::tests::discover_gate_filters_the_advert_push_per_viewer
2026-08-18T01:42:46.9985197Z warning: 1515/2580 tests were not run due to test failure (run with --no-fail-fast to run all tests, or run with --max-fail)
2026-08-18T01:42:47.0055179Z error: test run failed
2026-08-18T01:42:52.1530989Z ##[error]Process completed with exit code 1.
2026-08-18T01:42:52.1944469Z Post job cleanup.
2026-08-18T01:42:52.4447214Z [command]"C:\Program Files\Git\cmd\git.exe" version
2026-08-18T01:42:52.4692292Z git version 2.43.0.windows.1
2026-08-18T01:42:52.4732665Z Copying 'C:\Users\decid\.gitconfig' to 'C:\actions-runner\_work\_temp\6f590d26-e361-403e-9a54-2fed2cbf54b2\.gitconfig'
2026-08-18T01:42:52.4747290Z Temporarily overriding HOME='C:\actions-runner\_work\_temp\6f590d26-e361-403e-9a54-2fed2cbf54b2' before making global git config changes
2026-08-18T01:42:52.4747883Z Adding repository directory to the temporary git global config as a safe directory
2026-08-18T01:42:52.4755560Z [command]"C:\Program Files\Git\cmd\git.exe" config --global --add safe.directory C:\actions-runner\_work\spt-bs-core\spt-bs-core
2026-08-18T01:42:52.5467959Z [command]"C:\Program Files\Git\cmd\git.exe" config --local --name-only --get-regexp core\.sshCommand
2026-08-18T01:42:52.5735866Z [command]"C:\Program Files\Git\cmd\git.exe" submodule foreach --recursive "sh -c \"git config --local --name-only --get-regexp 'core\.sshCommand' && git config --local --unset-all 'core.sshCommand' || :\""
2026-08-18T01:42:53.8536343Z [command]"C:\Program Files\Git\cmd\git.exe" config --local --name-only --get-regexp http\.https\:\/\/github\.com\/\.extraheader
2026-08-18T01:42:53.8807623Z http.https://github.com/.extraheader
2026-08-18T01:42:53.8835731Z [command]"C:\Program Files\Git\cmd\git.exe" config --local --unset-all http.https://github.com/.extraheader
2026-08-18T01:42:53.9152565Z [command]"C:\Program Files\Git\cmd\git.exe" submodule foreach --recursive "sh -c \"git config --local --name-only --get-regexp 'http\.https\:\/\/github\.com\/\.extraheader' && git config --local --unset-all 'http.https://github.com/.extraheader' || :\""
2026-08-18T01:42:54.5956776Z [command]"C:\Program Files\Git\cmd\git.exe" config --local --name-only --get-regexp ^includeIf\.gitdir:
2026-08-18T01:42:54.6228506Z [command]"C:\Program Files\Git\cmd\git.exe" submodule foreach --recursive "git config --local --show-origin --name-only --get-regexp remote.origin.url"
2026-08-18T01:42:55.3085775Z Cleaning up orphan processes
2026-08-18T01:42:55.3840851Z Terminate orphan process: pid (25824) (PING)
2026-08-18T01:42:55.3900152Z Terminate orphan process: pid (46744) (PING)
2026-08-18T01:42:55.3958653Z Terminate orphan process: pid (50472) (PING)
2026-08-18T01:42:55.4013563Z Terminate orphan process: pid (32456) (PING)
